{"text_format":"2","workbook":"xlsx","n_sheets":12,"sheets":["_!DropData","_!Helpful Tips","Plate01","Plate02","Plate03","Plate04","Plate05","Plate06","Plate07","Plate08","Plate09","Plate10"],"not_rendered":{"charts":0,"images":2,"macros":0,"external_links":0,"defined_names":1,"comments":0,"pivot_tables":0},"unopened":[],"bounds":{"document_bytes":16777216,"sheet_cells":100000,"run_cost":"one","rows_first":2000,"rows_last":500,"rows_between":2000,"halvings":0,"cell_chars":16384,"cell_head_chars":4096},"cells_cut":0,"cells_raw":0,"read":"whole","date_system":"1900"}

{"sheet":"_!DropData","index":0,"n_rows":5,"n_cols":1,"rows_kept":5,"cut":false,"hidden":true,"merged":[]}
[]
[]
[]
["By Columns"]
["By Rows"]

{"sheet":"_!Helpful Tips","index":1,"n_rows":25,"n_cols":6,"rows_kept":25,"cut":false,"hidden":false,"merged":[[29,3,29,7],[31,3,31,12],[5,4,5,11],[12,3,14,12],[16,3,18,12],[20,3,22,12],[24,3,26,12]]}
[]
[]
[]
[]
[]
[{"$nulls":4},"Trouble Uploading the Template?"]
[]
[{"$nulls":4},"Phone Support:  ","1-800-688-2248 "]
[{"$nulls":4},"Email Support:  ","GenomicsSupport@eurofins.com"]
[]
[null,null,null,"Common Hiccups "]
[]
[null,null,1,"Invalid Characters: It is easy to accidentally insert invalid characters into the primer name or DNA name fields.  Acceptable characters include any letters (A-Z), numbers (0-9), and an underscore or dash."]
[]
[]
[]
[null,null,2,"Empty Wells: To leave a well empty, simply leave the cell(s) blank. Do not delete the well position. "]
[]
[]
[]
[null,null,3,"Plate Name: To name your plate, change the corresponding worksheet's name. "]
[]
[]
[]
[null,null,4,"Plate Order: Each plate/worksheet in this template should correspond to each plate of DNA you will ship to Eurofins."]

{"sheet":"Plate01","index":2,"n_rows":105,"n_cols":3,"rows_kept":105,"cut":false,"hidden":false,"merged":[[4,1,4,2]]}
[]
[null,"Nanopore Sequencing"]
[null,"Upload form"]
[]
[null,"Plate Information"]
[null,"Sort Plate:","By Columns"]
[]
[]
[null,"Well Position","Sample Name"]
[null,"A1","Example"]
[null,{"$f":"IF($C$6=\"By Rows\", \"A2\", \"B1\")","v":"B1"}]
[null,{"$f":"IF($C$6=\"By Rows\", \"A3\", \"C1\")","v":"C1"}]
[null,{"$f":"IF($C$6=\"By Rows\", \"A4\", \"D1\")","v":"D1"}]
[null,{"$f":"IF($C$6=\"By Rows\", \"A5\", \"E1\")","v":"E1"}]
[null,{"$f":"IF($C$6=\"By Rows\", \"A6\", \"F1\")","v":"F1"}]
[null,{"$f":"IF($C$6=\"By Rows\", \"A7\", \"G1\")","v":"G1"}]
[null,{"$f":"IF($C$6=\"By Rows\", \"A8\", \"H1\")","v":"H1"}]
[null,{"$f":"IF($C$6=\"By Rows\", \"A9\", \"A2\")","v":"A2"}]
[null,{"$f":"IF($C$6=\"By Rows\", \"A10\", \"B2\")","v":"B2"}]
[null,{"$f":"IF($C$6=\"By Rows\", \"A11\", \"C2\")","v":"C2"}]
[null,{"$f":"IF($C$6=\"By Rows\", \"A12\", \"D2\")","v":"D2"}]
[null,{"$f":"IF($C$6=\"By Rows\", \"B1\", \"E2\")","v":"E2"}]
[null,{"$f":"IF($C$6=\"By Rows\", \"B2\", \"F2\")","v":"F2"}]
[null,{"$f":"IF($C$6=\"By Rows\", \"B3\", \"G2\")","v":"G2"}]
[null,{"$f":"IF($C$6=\"By Rows\", \"B4\", \"H2\")","v":"H2"}]
[null,{"$f":"IF($C$6=\"By Rows\", \"B5\", \"A3\")","v":"A3"}]
[null,{"$f":"IF($C$6=\"By Rows\", \"B6\", \"B3\")","v":"B3"}]
[null,{"$f":"IF($C$6=\"By Rows\", \"B7\", \"C3\")","v":"C3"}]
[null,{"$f":"IF($C$6=\"By Rows\", \"B8\", \"D3\")","v":"D3"}]
[null,{"$f":"IF($C$6=\"By Rows\", \"B9\", \"E3\")","v":"E3"}]
[null,{"$f":"IF($C$6=\"By Rows\", \"B10\", \"F3\")","v":"F3"}]
[null,{"$f":"IF($C$6=\"By Rows\", \"B11\", \"G3\")","v":"G3"}]
[null,{"$f":"IF($C$6=\"By Rows\", \"B12\", \"H3\")","v":"H3"}]
[null,{"$f":"IF($C$6=\"By Rows\", \"C1\", \"A4\")","v":"A4"}]
[null,{"$f":"IF($C$6=\"By Rows\", \"C2\", \"B4\")","v":"B4"}]
[null,{"$f":"IF($C$6=\"By Rows\", \"C3\", \"C4\")","v":"C4"}]
[null,{"$f":"IF($C$6=\"By Rows\", \"C4\", \"D4\")","v":"D4"}]
[null,{"$f":"IF($C$6=\"By Rows\", \"C5\", \"E4\")","v":"E4"}]
[null,{"$f":"IF($C$6=\"By Rows\", \"C6\", \"F4\")","v":"F4"}]
[null,{"$f":"IF($C$6=\"By Rows\", \"C7\", \"G4\")","v":"G4"}]
[null,{"$f":"IF($C$6=\"By Rows\", \"C8\", \"H4\")","v":"H4"}]
[null,{"$f":"IF($C$6=\"By Rows\", \"C9\", \"A5\")","v":"A5"}]
[null,{"$f":"IF($C$6=\"By Rows\", \"C10\", \"B5\")","v":"B5"}]
[null,{"$f":"IF($C$6=\"By Rows\", \"C11\", \"C5\")","v":"C5"}]
[null,{"$f":"IF($C$6=\"By Rows\", \"C12\", \"D5\")","v":"D5"}]
[null,{"$f":"IF($C$6=\"By Rows\", \"D1\", \"E5\")","v":"E5"}]
[null,{"$f":"IF($C$6=\"By Rows\", \"D2\", \"F5\")","v":"F5"}]
[null,{"$f":"IF($C$6=\"By Rows\", \"D3\", \"G5\")","v":"G5"}]
[null,{"$f":"IF($C$6=\"By Rows\", \"D4\", \"H5\")","v":"H5"}]
[null,{"$f":"IF($C$6=\"By Rows\", \"D5\", \"A6\")","v":"A6"}]
[null,{"$f":"IF($C$6=\"By Rows\", \"D6\", \"B6\")","v":"B6"}]
[null,{"$f":"IF($C$6=\"By Rows\", \"D7\", \"C6\")","v":"C6"}]
[null,{"$f":"IF($C$6=\"By Rows\", \"D8\", \"D6\")","v":"D6"}]
[null,{"$f":"IF($C$6=\"By Rows\", \"D9\", \"E6\")","v":"E6"}]
[null,{"$f":"IF($C$6=\"By Rows\", \"D10\", \"F6\")","v":"F6"}]
[null,{"$f":"IF($C$6=\"By Rows\", \"D11\", \"G6\")","v":"G6"}]
[null,{"$f":"IF($C$6=\"By Rows\", \"D12\", \"H6\")","v":"H6"}]
[null,{"$f":"IF($C$6=\"By Rows\", \"E1\", \"A7\")","v":"A7"}]
[null,{"$f":"IF($C$6=\"By Rows\", \"E2\", \"B7\")","v":"B7"}]
[null,{"$f":"IF($C$6=\"By Rows\", \"E3\", \"C7\")","v":"C7"}]
[null,{"$f":"IF($C$6=\"By Rows\", \"E4\", \"D7\")","v":"D7"}]
[null,{"$f":"IF($C$6=\"By Rows\", \"E5\", \"E7\")","v":"E7"}]
[null,{"$f":"IF($C$6=\"By Rows\", \"E6\", \"F7\")","v":"F7"}]
[null,{"$f":"IF($C$6=\"By Rows\", \"E7\", \"G7\")","v":"G7"}]
[null,{"$f":"IF($C$6=\"By Rows\", \"E8\", \"H7\")","v":"H7"}]
[null,{"$f":"IF($C$6=\"By Rows\", \"E9\", \"A8\")","v":"A8"}]
[null,{"$f":"IF($C$6=\"By Rows\", \"E10\", \"B8\")","v":"B8"}]
[null,{"$f":"IF($C$6=\"By Rows\", \"E11\", \"C8\")","v":"C8"}]
[null,{"$f":"IF($C$6=\"By Rows\", \"E12\", \"D8\")","v":"D8"}]
[null,{"$f":"IF($C$6=\"By Rows\", \"F1\", \"E8\")","v":"E8"}]
[null,{"$f":"IF($C$6=\"By Rows\", \"F2\", \"F8\")","v":"F8"}]
[null,{"$f":"IF($C$6=\"By Rows\", \"F3\", \"G8\")","v":"G8"}]
[null,{"$f":"IF($C$6=\"By Rows\", \"F4\", \"H8\")","v":"H8"}]
[null,{"$f":"IF($C$6=\"By Rows\", \"F5\", \"A9\")","v":"A9"}]
[null,{"$f":"IF($C$6=\"By Rows\", \"F6\", \"B9\")","v":"B9"}]
[null,{"$f":"IF($C$6=\"By Rows\", \"F7\", \"C9\")","v":"C9"}]
[null,{"$f":"IF($C$6=\"By Rows\", \"F8\", \"D9\")","v":"D9"}]
[null,{"$f":"IF($C$6=\"By Rows\", \"F9\", \"E9\")","v":"E9"}]
[null,{"$f":"IF($C$6=\"By Rows\", \"F10\", \"F9\")","v":"F9"}]
[null,{"$f":"IF($C$6=\"By Rows\", \"F11\", \"G9\")","v":"G9"}]
[null,{"$f":"IF($C$6=\"By Rows\", \"F12\", \"H9\")","v":"H9"}]
[null,{"$f":"IF($C$6=\"By Rows\", \"G1\", \"A10\")","v":"A10"}]
[null,{"$f":"IF($C$6=\"By Rows\", \"G2\", \"B10\")","v":"B10"}]
[null,{"$f":"IF($C$6=\"By Rows\", \"G3\", \"C10\")","v":"C10"}]
[null,{"$f":"IF($C$6=\"By Rows\", \"G4\", \"D10\")","v":"D10"}]
[null,{"$f":"IF($C$6=\"By Rows\", \"G5\", \"E10\")","v":"E10"}]
[null,{"$f":"IF($C$6=\"By Rows\", \"G6\", \"F10\")","v":"F10"}]
[null,{"$f":"IF($C$6=\"By Rows\", \"G7\", \"G10\")","v":"G10"}]
[null,{"$f":"IF($C$6=\"By Rows\", \"G8\", \"H10\")","v":"H10"}]
[null,{"$f":"IF($C$6=\"By Rows\", \"G9\", \"A11\")","v":"A11"}]
[null,{"$f":"IF($C$6=\"By Rows\", \"G10\", \"B11\")","v":"B11"}]
[null,{"$f":"IF($C$6=\"By Rows\", \"G11\", \"C11\")","v":"C11"}]
[null,{"$f":"IF($C$6=\"By Rows\", \"G12\", \"D11\")","v":"D11"}]
[null,{"$f":"IF($C$6=\"By Rows\", \"H1\", \"E11\")","v":"E11"}]
[null,{"$f":"IF($C$6=\"By Rows\", \"H2\", \"F11\")","v":"F11"}]
[null,{"$f":"IF($C$6=\"By Rows\", \"H3\", \"G11\")","v":"G11"}]
[null,{"$f":"IF($C$6=\"By Rows\", \"H4\", \"H11\")","v":"H11"}]
[null,{"$f":"IF($C$6=\"By Rows\", \"H5\", \"A12\")","v":"A12"}]
[null,{"$f":"IF($C$6=\"By Rows\", \"H6\", \"B12\")","v":"B12"}]
[null,{"$f":"IF($C$6=\"By Rows\", \"H7\", \"C12\")","v":"C12"}]
[null,{"$f":"IF($C$6=\"By Rows\", \"H8\", \"D12\")","v":"D12"}]
[null,{"$f":"IF($C$6=\"By Rows\", \"H9\", \"E12\")","v":"E12"}]
[null,{"$f":"IF($C$6=\"By Rows\", \"H10\", \"F12\")","v":"F12"}]
[null,{"$f":"IF($C$6=\"By Rows\", \"H11\", \"G12\")","v":"G12"}]
[null,"H12"]

{"sheet":"Plate02","index":3,"n_rows":105,"n_cols":3,"rows_kept":105,"cut":false,"hidden":false,"merged":[[4,1,4,2]]}
[]
[null,"Whole Plasmid Sequencing"]
[null,"Upload form"]
[]
[null,"Plate Information"]
[null,"Sort Plate:","By Columns"]
[]
[]
[null,"Well Position","Sample Name"]
[null,"A1"]
[null,{"$f":"IF($C$6=\"By Rows\", \"A2\", \"B1\")","v":"B1"}]
[null,{"$f":"IF($C$6=\"By Rows\", \"A3\", \"C1\")","v":"C1"}]
[null,{"$f":"IF($C$6=\"By Rows\", \"A4\", \"D1\")","v":"D1"}]
[null,{"$f":"IF($C$6=\"By Rows\", \"A5\", \"E1\")","v":"E1"}]
[null,{"$f":"IF($C$6=\"By Rows\", \"A6\", \"F1\")","v":"F1"}]
[null,{"$f":"IF($C$6=\"By Rows\", \"A7\", \"G1\")","v":"G1"}]
[null,{"$f":"IF($C$6=\"By Rows\", \"A8\", \"H1\")","v":"H1"}]
[null,{"$f":"IF($C$6=\"By Rows\", \"A9\", \"A2\")","v":"A2"}]
[null,{"$f":"IF($C$6=\"By Rows\", \"A10\", \"B2\")","v":"B2"}]
[null,{"$f":"IF($C$6=\"By Rows\", \"A11\", \"C2\")","v":"C2"}]
[null,{"$f":"IF($C$6=\"By Rows\", \"A12\", \"D2\")","v":"D2"}]
[null,{"$f":"IF($C$6=\"By Rows\", \"B1\", \"E2\")","v":"E2"}]
[null,{"$f":"IF($C$6=\"By Rows\", \"B2\", \"F2\")","v":"F2"}]
[null,{"$f":"IF($C$6=\"By Rows\", \"B3\", \"G2\")","v":"G2"}]
[null,{"$f":"IF($C$6=\"By Rows\", \"B4\", \"H2\")","v":"H2"}]
[null,{"$f":"IF($C$6=\"By Rows\", \"B5\", \"A3\")","v":"A3"}]
[null,{"$f":"IF($C$6=\"By Rows\", \"B6\", \"B3\")","v":"B3"}]
[null,{"$f":"IF($C$6=\"By Rows\", \"B7\", \"C3\")","v":"C3"}]
[null,{"$f":"IF($C$6=\"By Rows\", \"B8\", \"D3\")","v":"D3"}]
[null,{"$f":"IF($C$6=\"By Rows\", \"B9\", \"E3\")","v":"E3"}]
[null,{"$f":"IF($C$6=\"By Rows\", \"B10\", \"F3\")","v":"F3"}]
[null,{"$f":"IF($C$6=\"By Rows\", \"B11\", \"G3\")","v":"G3"}]
[null,{"$f":"IF($C$6=\"By Rows\", \"B12\", \"H3\")","v":"H3"}]
[null,{"$f":"IF($C$6=\"By Rows\", \"C1\", \"A4\")","v":"A4"}]
[null,{"$f":"IF($C$6=\"By Rows\", \"C2\", \"B4\")","v":"B4"}]
[null,{"$f":"IF($C$6=\"By Rows\", \"C3\", \"C4\")","v":"C4"}]
[null,{"$f":"IF($C$6=\"By Rows\", \"C4\", \"D4\")","v":"D4"}]
[null,{"$f":"IF($C$6=\"By Rows\", \"C5\", \"E4\")","v":"E4"}]
[null,{"$f":"IF($C$6=\"By Rows\", \"C6\", \"F4\")","v":"F4"}]
[null,{"$f":"IF($C$6=\"By Rows\", \"C7\", \"G4\")","v":"G4"}]
[null,{"$f":"IF($C$6=\"By Rows\", \"C8\", \"H4\")","v":"H4"}]
[null,{"$f":"IF($C$6=\"By Rows\", \"C9\", \"A5\")","v":"A5"}]
[null,{"$f":"IF($C$6=\"By Rows\", \"C10\", \"B5\")","v":"B5"}]
[null,{"$f":"IF($C$6=\"By Rows\", \"C11\", \"C5\")","v":"C5"}]
[null,{"$f":"IF($C$6=\"By Rows\", \"C12\", \"D5\")","v":"D5"}]
[null,{"$f":"IF($C$6=\"By Rows\", \"D1\", \"E5\")","v":"E5"}]
[null,{"$f":"IF($C$6=\"By Rows\", \"D2\", \"F5\")","v":"F5"}]
[null,{"$f":"IF($C$6=\"By Rows\", \"D3\", \"G5\")","v":"G5"}]
[null,{"$f":"IF($C$6=\"By Rows\", \"D4\", \"H5\")","v":"H5"}]
[null,{"$f":"IF($C$6=\"By Rows\", \"D5\", \"A6\")","v":"A6"}]
[null,{"$f":"IF($C$6=\"By Rows\", \"D6\", \"B6\")","v":"B6"}]
[null,{"$f":"IF($C$6=\"By Rows\", \"D7\", \"C6\")","v":"C6"}]
[null,{"$f":"IF($C$6=\"By Rows\", \"D8\", \"D6\")","v":"D6"}]
[null,{"$f":"IF($C$6=\"By Rows\", \"D9\", \"E6\")","v":"E6"}]
[null,{"$f":"IF($C$6=\"By Rows\", \"D10\", \"F6\")","v":"F6"}]
[null,{"$f":"IF($C$6=\"By Rows\", \"D11\", \"G6\")","v":"G6"}]
[null,{"$f":"IF($C$6=\"By Rows\", \"D12\", \"H6\")","v":"H6"}]
[null,{"$f":"IF($C$6=\"By Rows\", \"E1\", \"A7\")","v":"A7"}]
[null,{"$f":"IF($C$6=\"By Rows\", \"E2\", \"B7\")","v":"B7"}]
[null,{"$f":"IF($C$6=\"By Rows\", \"E3\", \"C7\")","v":"C7"}]
[null,{"$f":"IF($C$6=\"By Rows\", \"E4\", \"D7\")","v":"D7"}]
[null,{"$f":"IF($C$6=\"By Rows\", \"E5\", \"E7\")","v":"E7"}]
[null,{"$f":"IF($C$6=\"By Rows\", \"E6\", \"F7\")","v":"F7"}]
[null,{"$f":"IF($C$6=\"By Rows\", \"E7\", \"G7\")","v":"G7"}]
[null,{"$f":"IF($C$6=\"By Rows\", \"E8\", \"H7\")","v":"H7"}]
[null,{"$f":"IF($C$6=\"By Rows\", \"E9\", \"A8\")","v":"A8"}]
[null,{"$f":"IF($C$6=\"By Rows\", \"E10\", \"B8\")","v":"B8"}]
[null,{"$f":"IF($C$6=\"By Rows\", \"E11\", \"C8\")","v":"C8"}]
[null,{"$f":"IF($C$6=\"By Rows\", \"E12\", \"D8\")","v":"D8"}]
[null,{"$f":"IF($C$6=\"By Rows\", \"F1\", \"E8\")","v":"E8"}]
[null,{"$f":"IF($C$6=\"By Rows\", \"F2\", \"F8\")","v":"F8"}]
[null,{"$f":"IF($C$6=\"By Rows\", \"F3\", \"G8\")","v":"G8"}]
[null,{"$f":"IF($C$6=\"By Rows\", \"F4\", \"H8\")","v":"H8"}]
[null,{"$f":"IF($C$6=\"By Rows\", \"F5\", \"A9\")","v":"A9"}]
[null,{"$f":"IF($C$6=\"By Rows\", \"F6\", \"B9\")","v":"B9"}]
[null,{"$f":"IF($C$6=\"By Rows\", \"F7\", \"C9\")","v":"C9"}]
[null,{"$f":"IF($C$6=\"By Rows\", \"F8\", \"D9\")","v":"D9"}]
[null,{"$f":"IF($C$6=\"By Rows\", \"F9\", \"E9\")","v":"E9"}]
[null,{"$f":"IF($C$6=\"By Rows\", \"F10\", \"F9\")","v":"F9"}]
[null,{"$f":"IF($C$6=\"By Rows\", \"F11\", \"G9\")","v":"G9"}]
[null,{"$f":"IF($C$6=\"By Rows\", \"F12\", \"H9\")","v":"H9"}]
[null,{"$f":"IF($C$6=\"By Rows\", \"G1\", \"A10\")","v":"A10"}]
[null,{"$f":"IF($C$6=\"By Rows\", \"G2\", \"B10\")","v":"B10"}]
[null,{"$f":"IF($C$6=\"By Rows\", \"G3\", \"C10\")","v":"C10"}]
[null,{"$f":"IF($C$6=\"By Rows\", \"G4\", \"D10\")","v":"D10"}]
[null,{"$f":"IF($C$6=\"By Rows\", \"G5\", \"E10\")","v":"E10"}]
[null,{"$f":"IF($C$6=\"By Rows\", \"G6\", \"F10\")","v":"F10"}]
[null,{"$f":"IF($C$6=\"By Rows\", \"G7\", \"G10\")","v":"G10"}]
[null,{"$f":"IF($C$6=\"By Rows\", \"G8\", \"H10\")","v":"H10"}]
[null,{"$f":"IF($C$6=\"By Rows\", \"G9\", \"A11\")","v":"A11"}]
[null,{"$f":"IF($C$6=\"By Rows\", \"G10\", \"B11\")","v":"B11"}]
[null,{"$f":"IF($C$6=\"By Rows\", \"G11\", \"C11\")","v":"C11"}]
[null,{"$f":"IF($C$6=\"By Rows\", \"G12\", \"D11\")","v":"D11"}]
[null,{"$f":"IF($C$6=\"By Rows\", \"H1\", \"E11\")","v":"E11"}]
[null,{"$f":"IF($C$6=\"By Rows\", \"H2\", \"F11\")","v":"F11"}]
[null,{"$f":"IF($C$6=\"By Rows\", \"H3\", \"G11\")","v":"G11"}]
[null,{"$f":"IF($C$6=\"By Rows\", \"H4\", \"H11\")","v":"H11"}]
[null,{"$f":"IF($C$6=\"By Rows\", \"H5\", \"A12\")","v":"A12"}]
[null,{"$f":"IF($C$6=\"By Rows\", \"H6\", \"B12\")","v":"B12"}]
[null,{"$f":"IF($C$6=\"By Rows\", \"H7\", \"C12\")","v":"C12"}]
[null,{"$f":"IF($C$6=\"By Rows\", \"H8\", \"D12\")","v":"D12"}]
[null,{"$f":"IF($C$6=\"By Rows\", \"H9\", \"E12\")","v":"E12"}]
[null,{"$f":"IF($C$6=\"By Rows\", \"H10\", \"F12\")","v":"F12"}]
[null,{"$f":"IF($C$6=\"By Rows\", \"H11\", \"G12\")","v":"G12"}]
[null,"H12"]

{"sheet":"Plate03","index":4,"n_rows":105,"n_cols":3,"rows_kept":105,"cut":false,"hidden":false,"merged":[[4,1,4,2]]}
[]
[null,"Whole Plasmid Sequencing"]
[null,"Upload form"]
[]
[null,"Plate Information"]
[null,"Sort Plate:","By Columns"]
[]
[]
[null,"Well Position","Sample Name"]
[null,"A1"]
[null,{"$f":"IF($C$6=\"By Rows\", \"A2\", \"B1\")","v":"B1"}]
[null,{"$f":"IF($C$6=\"By Rows\", \"A3\", \"C1\")","v":"C1"}]
[null,{"$f":"IF($C$6=\"By Rows\", \"A4\", \"D1\")","v":"D1"}]
[null,{"$f":"IF($C$6=\"By Rows\", \"A5\", \"E1\")","v":"E1"}]
[null,{"$f":"IF($C$6=\"By Rows\", \"A6\", \"F1\")","v":"F1"}]
[null,{"$f":"IF($C$6=\"By Rows\", \"A7\", \"G1\")","v":"G1"}]
[null,{"$f":"IF($C$6=\"By Rows\", \"A8\", \"H1\")","v":"H1"}]
[null,{"$f":"IF($C$6=\"By Rows\", \"A9\", \"A2\")","v":"A2"}]
[null,{"$f":"IF($C$6=\"By Rows\", \"A10\", \"B2\")","v":"B2"}]
[null,{"$f":"IF($C$6=\"By Rows\", \"A11\", \"C2\")","v":"C2"}]
[null,{"$f":"IF($C$6=\"By Rows\", \"A12\", \"D2\")","v":"D2"}]
[null,{"$f":"IF($C$6=\"By Rows\", \"B1\", \"E2\")","v":"E2"}]
[null,{"$f":"IF($C$6=\"By Rows\", \"B2\", \"F2\")","v":"F2"}]
[null,{"$f":"IF($C$6=\"By Rows\", \"B3\", \"G2\")","v":"G2"}]
[null,{"$f":"IF($C$6=\"By Rows\", \"B4\", \"H2\")","v":"H2"}]
[null,{"$f":"IF($C$6=\"By Rows\", \"B5\", \"A3\")","v":"A3"}]
[null,{"$f":"IF($C$6=\"By Rows\", \"B6\", \"B3\")","v":"B3"}]
[null,{"$f":"IF($C$6=\"By Rows\", \"B7\", \"C3\")","v":"C3"}]
[null,{"$f":"IF($C$6=\"By Rows\", \"B8\", \"D3\")","v":"D3"}]
[null,{"$f":"IF($C$6=\"By Rows\", \"B9\", \"E3\")","v":"E3"}]
[null,{"$f":"IF($C$6=\"By Rows\", \"B10\", \"F3\")","v":"F3"}]
[null,{"$f":"IF($C$6=\"By Rows\", \"B11\", \"G3\")","v":"G3"}]
[null,{"$f":"IF($C$6=\"By Rows\", \"B12\", \"H3\")","v":"H3"}]
[null,{"$f":"IF($C$6=\"By Rows\", \"C1\", \"A4\")","v":"A4"}]
[null,{"$f":"IF($C$6=\"By Rows\", \"C2\", \"B4\")","v":"B4"}]
[null,{"$f":"IF($C$6=\"By Rows\", \"C3\", \"C4\")","v":"C4"}]
[null,{"$f":"IF($C$6=\"By Rows\", \"C4\", \"D4\")","v":"D4"}]
[null,{"$f":"IF($C$6=\"By Rows\", \"C5\", \"E4\")","v":"E4"}]
[null,{"$f":"IF($C$6=\"By Rows\", \"C6\", \"F4\")","v":"F4"}]
[null,{"$f":"IF($C$6=\"By Rows\", \"C7\", \"G4\")","v":"G4"}]
[null,{"$f":"IF($C$6=\"By Rows\", \"C8\", \"H4\")","v":"H4"}]
[null,{"$f":"IF($C$6=\"By Rows\", \"C9\", \"A5\")","v":"A5"}]
[null,{"$f":"IF($C$6=\"By Rows\", \"C10\", \"B5\")","v":"B5"}]
[null,{"$f":"IF($C$6=\"By Rows\", \"C11\", \"C5\")","v":"C5"}]
[null,{"$f":"IF($C$6=\"By Rows\", \"C12\", \"D5\")","v":"D5"}]
[null,{"$f":"IF($C$6=\"By Rows\", \"D1\", \"E5\")","v":"E5"}]
[null,{"$f":"IF($C$6=\"By Rows\", \"D2\", \"F5\")","v":"F5"}]
[null,{"$f":"IF($C$6=\"By Rows\", \"D3\", \"G5\")","v":"G5"}]
[null,{"$f":"IF($C$6=\"By Rows\", \"D4\", \"H5\")","v":"H5"}]
[null,{"$f":"IF($C$6=\"By Rows\", \"D5\", \"A6\")","v":"A6"}]
[null,{"$f":"IF($C$6=\"By Rows\", \"D6\", \"B6\")","v":"B6"}]
[null,{"$f":"IF($C$6=\"By Rows\", \"D7\", \"C6\")","v":"C6"}]
[null,{"$f":"IF($C$6=\"By Rows\", \"D8\", \"D6\")","v":"D6"}]
[null,{"$f":"IF($C$6=\"By Rows\", \"D9\", \"E6\")","v":"E6"}]
[null,{"$f":"IF($C$6=\"By Rows\", \"D10\", \"F6\")","v":"F6"}]
[null,{"$f":"IF($C$6=\"By Rows\", \"D11\", \"G6\")","v":"G6"}]
[null,{"$f":"IF($C$6=\"By Rows\", \"D12\", \"H6\")","v":"H6"}]
[null,{"$f":"IF($C$6=\"By Rows\", \"E1\", \"A7\")","v":"A7"}]
[null,{"$f":"IF($C$6=\"By Rows\", \"E2\", \"B7\")","v":"B7"}]
[null,{"$f":"IF($C$6=\"By Rows\", \"E3\", \"C7\")","v":"C7"}]
[null,{"$f":"IF($C$6=\"By Rows\", \"E4\", \"D7\")","v":"D7"}]
[null,{"$f":"IF($C$6=\"By Rows\", \"E5\", \"E7\")","v":"E7"}]
[null,{"$f":"IF($C$6=\"By Rows\", \"E6\", \"F7\")","v":"F7"}]
[null,{"$f":"IF($C$6=\"By Rows\", \"E7\", \"G7\")","v":"G7"}]
[null,{"$f":"IF($C$6=\"By Rows\", \"E8\", \"H7\")","v":"H7"}]
[null,{"$f":"IF($C$6=\"By Rows\", \"E9\", \"A8\")","v":"A8"}]
[null,{"$f":"IF($C$6=\"By Rows\", \"E10\", \"B8\")","v":"B8"}]
[null,{"$f":"IF($C$6=\"By Rows\", \"E11\", \"C8\")","v":"C8"}]
[null,{"$f":"IF($C$6=\"By Rows\", \"E12\", \"D8\")","v":"D8"}]
[null,{"$f":"IF($C$6=\"By Rows\", \"F1\", \"E8\")","v":"E8"}]
[null,{"$f":"IF($C$6=\"By Rows\", \"F2\", \"F8\")","v":"F8"}]
[null,{"$f":"IF($C$6=\"By Rows\", \"F3\", \"G8\")","v":"G8"}]
[null,{"$f":"IF($C$6=\"By Rows\", \"F4\", \"H8\")","v":"H8"}]
[null,{"$f":"IF($C$6=\"By Rows\", \"F5\", \"A9\")","v":"A9"}]
[null,{"$f":"IF($C$6=\"By Rows\", \"F6\", \"B9\")","v":"B9"}]
[null,{"$f":"IF($C$6=\"By Rows\", \"F7\", \"C9\")","v":"C9"}]
[null,{"$f":"IF($C$6=\"By Rows\", \"F8\", \"D9\")","v":"D9"}]
[null,{"$f":"IF($C$6=\"By Rows\", \"F9\", \"E9\")","v":"E9"}]
[null,{"$f":"IF($C$6=\"By Rows\", \"F10\", \"F9\")","v":"F9"}]
[null,{"$f":"IF($C$6=\"By Rows\", \"F11\", \"G9\")","v":"G9"}]
[null,{"$f":"IF($C$6=\"By Rows\", \"F12\", \"H9\")","v":"H9"}]
[null,{"$f":"IF($C$6=\"By Rows\", \"G1\", \"A10\")","v":"A10"}]
[null,{"$f":"IF($C$6=\"By Rows\", \"G2\", \"B10\")","v":"B10"}]
[null,{"$f":"IF($C$6=\"By Rows\", \"G3\", \"C10\")","v":"C10"}]
[null,{"$f":"IF($C$6=\"By Rows\", \"G4\", \"D10\")","v":"D10"}]
[null,{"$f":"IF($C$6=\"By Rows\", \"G5\", \"E10\")","v":"E10"}]
[null,{"$f":"IF($C$6=\"By Rows\", \"G6\", \"F10\")","v":"F10"}]
[null,{"$f":"IF($C$6=\"By Rows\", \"G7\", \"G10\")","v":"G10"}]
[null,{"$f":"IF($C$6=\"By Rows\", \"G8\", \"H10\")","v":"H10"}]
[null,{"$f":"IF($C$6=\"By Rows\", \"G9\", \"A11\")","v":"A11"}]
[null,{"$f":"IF($C$6=\"By Rows\", \"G10\", \"B11\")","v":"B11"}]
[null,{"$f":"IF($C$6=\"By Rows\", \"G11\", \"C11\")","v":"C11"}]
[null,{"$f":"IF($C$6=\"By Rows\", \"G12\", \"D11\")","v":"D11"}]
[null,{"$f":"IF($C$6=\"By Rows\", \"H1\", \"E11\")","v":"E11"}]
[null,{"$f":"IF($C$6=\"By Rows\", \"H2\", \"F11\")","v":"F11"}]
[null,{"$f":"IF($C$6=\"By Rows\", \"H3\", \"G11\")","v":"G11"}]
[null,{"$f":"IF($C$6=\"By Rows\", \"H4\", \"H11\")","v":"H11"}]
[null,{"$f":"IF($C$6=\"By Rows\", \"H5\", \"A12\")","v":"A12"}]
[null,{"$f":"IF($C$6=\"By Rows\", \"H6\", \"B12\")","v":"B12"}]
[null,{"$f":"IF($C$6=\"By Rows\", \"H7\", \"C12\")","v":"C12"}]
[null,{"$f":"IF($C$6=\"By Rows\", \"H8\", \"D12\")","v":"D12"}]
[null,{"$f":"IF($C$6=\"By Rows\", \"H9\", \"E12\")","v":"E12"}]
[null,{"$f":"IF($C$6=\"By Rows\", \"H10\", \"F12\")","v":"F12"}]
[null,{"$f":"IF($C$6=\"By Rows\", \"H11\", \"G12\")","v":"G12"}]
[null,"H12"]

{"sheet":"Plate04","index":5,"n_rows":105,"n_cols":3,"rows_kept":105,"cut":false,"hidden":false,"merged":[[4,1,4,2]]}
[]
[null,"Whole Plasmid Sequencing"]
[null,"Upload form"]
[]
[null,"Plate Information"]
[null,"Sort Plate:","By Columns"]
[]
[]
[null,"Well Position","Sample Name"]
[null,"A1"]
[null,{"$f":"IF($C$6=\"By Rows\", \"A2\", \"B1\")","v":"B1"}]
[null,{"$f":"IF($C$6=\"By Rows\", \"A3\", \"C1\")","v":"C1"}]
[null,{"$f":"IF($C$6=\"By Rows\", \"A4\", \"D1\")","v":"D1"}]
[null,{"$f":"IF($C$6=\"By Rows\", \"A5\", \"E1\")","v":"E1"}]
[null,{"$f":"IF($C$6=\"By Rows\", \"A6\", \"F1\")","v":"F1"}]
[null,{"$f":"IF($C$6=\"By Rows\", \"A7\", \"G1\")","v":"G1"}]
[null,{"$f":"IF($C$6=\"By Rows\", \"A8\", \"H1\")","v":"H1"}]
[null,{"$f":"IF($C$6=\"By Rows\", \"A9\", \"A2\")","v":"A2"}]
[null,{"$f":"IF($C$6=\"By Rows\", \"A10\", \"B2\")","v":"B2"}]
[null,{"$f":"IF($C$6=\"By Rows\", \"A11\", \"C2\")","v":"C2"}]
[null,{"$f":"IF($C$6=\"By Rows\", \"A12\", \"D2\")","v":"D2"}]
[null,{"$f":"IF($C$6=\"By Rows\", \"B1\", \"E2\")","v":"E2"}]
[null,{"$f":"IF($C$6=\"By Rows\", \"B2\", \"F2\")","v":"F2"}]
[null,{"$f":"IF($C$6=\"By Rows\", \"B3\", \"G2\")","v":"G2"}]
[null,{"$f":"IF($C$6=\"By Rows\", \"B4\", \"H2\")","v":"H2"}]
[null,{"$f":"IF($C$6=\"By Rows\", \"B5\", \"A3\")","v":"A3"}]
[null,{"$f":"IF($C$6=\"By Rows\", \"B6\", \"B3\")","v":"B3"}]
[null,{"$f":"IF($C$6=\"By Rows\", \"B7\", \"C3\")","v":"C3"}]
[null,{"$f":"IF($C$6=\"By Rows\", \"B8\", \"D3\")","v":"D3"}]
[null,{"$f":"IF($C$6=\"By Rows\", \"B9\", \"E3\")","v":"E3"}]
[null,{"$f":"IF($C$6=\"By Rows\", \"B10\", \"F3\")","v":"F3"}]
[null,{"$f":"IF($C$6=\"By Rows\", \"B11\", \"G3\")","v":"G3"}]
[null,{"$f":"IF($C$6=\"By Rows\", \"B12\", \"H3\")","v":"H3"}]
[null,{"$f":"IF($C$6=\"By Rows\", \"C1\", \"A4\")","v":"A4"}]
[null,{"$f":"IF($C$6=\"By Rows\", \"C2\", \"B4\")","v":"B4"}]
[null,{"$f":"IF($C$6=\"By Rows\", \"C3\", \"C4\")","v":"C4"}]
[null,{"$f":"IF($C$6=\"By Rows\", \"C4\", \"D4\")","v":"D4"}]
[null,{"$f":"IF($C$6=\"By Rows\", \"C5\", \"E4\")","v":"E4"}]
[null,{"$f":"IF($C$6=\"By Rows\", \"C6\", \"F4\")","v":"F4"}]
[null,{"$f":"IF($C$6=\"By Rows\", \"C7\", \"G4\")","v":"G4"}]
[null,{"$f":"IF($C$6=\"By Rows\", \"C8\", \"H4\")","v":"H4"}]
[null,{"$f":"IF($C$6=\"By Rows\", \"C9\", \"A5\")","v":"A5"}]
[null,{"$f":"IF($C$6=\"By Rows\", \"C10\", \"B5\")","v":"B5"}]
[null,{"$f":"IF($C$6=\"By Rows\", \"C11\", \"C5\")","v":"C5"}]
[null,{"$f":"IF($C$6=\"By Rows\", \"C12\", \"D5\")","v":"D5"}]
[null,{"$f":"IF($C$6=\"By Rows\", \"D1\", \"E5\")","v":"E5"}]
[null,{"$f":"IF($C$6=\"By Rows\", \"D2\", \"F5\")","v":"F5"}]
[null,{"$f":"IF($C$6=\"By Rows\", \"D3\", \"G5\")","v":"G5"}]
[null,{"$f":"IF($C$6=\"By Rows\", \"D4\", \"H5\")","v":"H5"}]
[null,{"$f":"IF($C$6=\"By Rows\", \"D5\", \"A6\")","v":"A6"}]
[null,{"$f":"IF($C$6=\"By Rows\", \"D6\", \"B6\")","v":"B6"}]
[null,{"$f":"IF($C$6=\"By Rows\", \"D7\", \"C6\")","v":"C6"}]
[null,{"$f":"IF($C$6=\"By Rows\", \"D8\", \"D6\")","v":"D6"}]
[null,{"$f":"IF($C$6=\"By Rows\", \"D9\", \"E6\")","v":"E6"}]
[null,{"$f":"IF($C$6=\"By Rows\", \"D10\", \"F6\")","v":"F6"}]
[null,{"$f":"IF($C$6=\"By Rows\", \"D11\", \"G6\")","v":"G6"}]
[null,{"$f":"IF($C$6=\"By Rows\", \"D12\", \"H6\")","v":"H6"}]
[null,{"$f":"IF($C$6=\"By Rows\", \"E1\", \"A7\")","v":"A7"}]
[null,{"$f":"IF($C$6=\"By Rows\", \"E2\", \"B7\")","v":"B7"}]
[null,{"$f":"IF($C$6=\"By Rows\", \"E3\", \"C7\")","v":"C7"}]
[null,{"$f":"IF($C$6=\"By Rows\", \"E4\", \"D7\")","v":"D7"}]
[null,{"$f":"IF($C$6=\"By Rows\", \"E5\", \"E7\")","v":"E7"}]
[null,{"$f":"IF($C$6=\"By Rows\", \"E6\", \"F7\")","v":"F7"}]
[null,{"$f":"IF($C$6=\"By Rows\", \"E7\", \"G7\")","v":"G7"}]
[null,{"$f":"IF($C$6=\"By Rows\", \"E8\", \"H7\")","v":"H7"}]
[null,{"$f":"IF($C$6=\"By Rows\", \"E9\", \"A8\")","v":"A8"}]
[null,{"$f":"IF($C$6=\"By Rows\", \"E10\", \"B8\")","v":"B8"}]
[null,{"$f":"IF($C$6=\"By Rows\", \"E11\", \"C8\")","v":"C8"}]
[null,{"$f":"IF($C$6=\"By Rows\", \"E12\", \"D8\")","v":"D8"}]
[null,{"$f":"IF($C$6=\"By Rows\", \"F1\", \"E8\")","v":"E8"}]
[null,{"$f":"IF($C$6=\"By Rows\", \"F2\", \"F8\")","v":"F8"}]
[null,{"$f":"IF($C$6=\"By Rows\", \"F3\", \"G8\")","v":"G8"}]
[null,{"$f":"IF($C$6=\"By Rows\", \"F4\", \"H8\")","v":"H8"}]
[null,{"$f":"IF($C$6=\"By Rows\", \"F5\", \"A9\")","v":"A9"}]
[null,{"$f":"IF($C$6=\"By Rows\", \"F6\", \"B9\")","v":"B9"}]
[null,{"$f":"IF($C$6=\"By Rows\", \"F7\", \"C9\")","v":"C9"}]
[null,{"$f":"IF($C$6=\"By Rows\", \"F8\", \"D9\")","v":"D9"}]
[null,{"$f":"IF($C$6=\"By Rows\", \"F9\", \"E9\")","v":"E9"}]
[null,{"$f":"IF($C$6=\"By Rows\", \"F10\", \"F9\")","v":"F9"}]
[null,{"$f":"IF($C$6=\"By Rows\", \"F11\", \"G9\")","v":"G9"}]
[null,{"$f":"IF($C$6=\"By Rows\", \"F12\", \"H9\")","v":"H9"}]
[null,{"$f":"IF($C$6=\"By Rows\", \"G1\", \"A10\")","v":"A10"}]
[null,{"$f":"IF($C$6=\"By Rows\", \"G2\", \"B10\")","v":"B10"}]
[null,{"$f":"IF($C$6=\"By Rows\", \"G3\", \"C10\")","v":"C10"}]
[null,{"$f":"IF($C$6=\"By Rows\", \"G4\", \"D10\")","v":"D10"}]
[null,{"$f":"IF($C$6=\"By Rows\", \"G5\", \"E10\")","v":"E10"}]
[null,{"$f":"IF($C$6=\"By Rows\", \"G6\", \"F10\")","v":"F10"}]
[null,{"$f":"IF($C$6=\"By Rows\", \"G7\", \"G10\")","v":"G10"}]
[null,{"$f":"IF($C$6=\"By Rows\", \"G8\", \"H10\")","v":"H10"}]
[null,{"$f":"IF($C$6=\"By Rows\", \"G9\", \"A11\")","v":"A11"}]
[null,{"$f":"IF($C$6=\"By Rows\", \"G10\", \"B11\")","v":"B11"}]
[null,{"$f":"IF($C$6=\"By Rows\", \"G11\", \"C11\")","v":"C11"}]
[null,{"$f":"IF($C$6=\"By Rows\", \"G12\", \"D11\")","v":"D11"}]
[null,{"$f":"IF($C$6=\"By Rows\", \"H1\", \"E11\")","v":"E11"}]
[null,{"$f":"IF($C$6=\"By Rows\", \"H2\", \"F11\")","v":"F11"}]
[null,{"$f":"IF($C$6=\"By Rows\", \"H3\", \"G11\")","v":"G11"}]
[null,{"$f":"IF($C$6=\"By Rows\", \"H4\", \"H11\")","v":"H11"}]
[null,{"$f":"IF($C$6=\"By Rows\", \"H5\", \"A12\")","v":"A12"}]
[null,{"$f":"IF($C$6=\"By Rows\", \"H6\", \"B12\")","v":"B12"}]
[null,{"$f":"IF($C$6=\"By Rows\", \"H7\", \"C12\")","v":"C12"}]
[null,{"$f":"IF($C$6=\"By Rows\", \"H8\", \"D12\")","v":"D12"}]
[null,{"$f":"IF($C$6=\"By Rows\", \"H9\", \"E12\")","v":"E12"}]
[null,{"$f":"IF($C$6=\"By Rows\", \"H10\", \"F12\")","v":"F12"}]
[null,{"$f":"IF($C$6=\"By Rows\", \"H11\", \"G12\")","v":"G12"}]
[null,"H12"]

{"sheet":"Plate05","index":6,"n_rows":105,"n_cols":3,"rows_kept":105,"cut":false,"hidden":false,"merged":[[4,1,4,2]]}
[]
[null,"Whole Plasmid Sequencing"]
[null,"Upload form"]
[]
[null,"Plate Information"]
[null,"Sort Plate:","By Columns"]
[]
[]
[null,"Well Position","Sample Name"]
[null,"A1"]
[null,{"$f":"IF($C$6=\"By Rows\", \"A2\", \"B1\")","v":"B1"}]
[null,{"$f":"IF($C$6=\"By Rows\", \"A3\", \"C1\")","v":"C1"}]
[null,{"$f":"IF($C$6=\"By Rows\", \"A4\", \"D1\")","v":"D1"}]
[null,{"$f":"IF($C$6=\"By Rows\", \"A5\", \"E1\")","v":"E1"}]
[null,{"$f":"IF($C$6=\"By Rows\", \"A6\", \"F1\")","v":"F1"}]
[null,{"$f":"IF($C$6=\"By Rows\", \"A7\", \"G1\")","v":"G1"}]
[null,{"$f":"IF($C$6=\"By Rows\", \"A8\", \"H1\")","v":"H1"}]
[null,{"$f":"IF($C$6=\"By Rows\", \"A9\", \"A2\")","v":"A2"}]
[null,{"$f":"IF($C$6=\"By Rows\", \"A10\", \"B2\")","v":"B2"}]
[null,{"$f":"IF($C$6=\"By Rows\", \"A11\", \"C2\")","v":"C2"}]
[null,{"$f":"IF($C$6=\"By Rows\", \"A12\", \"D2\")","v":"D2"}]
[null,{"$f":"IF($C$6=\"By Rows\", \"B1\", \"E2\")","v":"E2"}]
[null,{"$f":"IF($C$6=\"By Rows\", \"B2\", \"F2\")","v":"F2"}]
[null,{"$f":"IF($C$6=\"By Rows\", \"B3\", \"G2\")","v":"G2"}]
[null,{"$f":"IF($C$6=\"By Rows\", \"B4\", \"H2\")","v":"H2"}]
[null,{"$f":"IF($C$6=\"By Rows\", \"B5\", \"A3\")","v":"A3"}]
[null,{"$f":"IF($C$6=\"By Rows\", \"B6\", \"B3\")","v":"B3"}]
[null,{"$f":"IF($C$6=\"By Rows\", \"B7\", \"C3\")","v":"C3"}]
[null,{"$f":"IF($C$6=\"By Rows\", \"B8\", \"D3\")","v":"D3"}]
[null,{"$f":"IF($C$6=\"By Rows\", \"B9\", \"E3\")","v":"E3"}]
[null,{"$f":"IF($C$6=\"By Rows\", \"B10\", \"F3\")","v":"F3"}]
[null,{"$f":"IF($C$6=\"By Rows\", \"B11\", \"G3\")","v":"G3"}]
[null,{"$f":"IF($C$6=\"By Rows\", \"B12\", \"H3\")","v":"H3"}]
[null,{"$f":"IF($C$6=\"By Rows\", \"C1\", \"A4\")","v":"A4"}]
[null,{"$f":"IF($C$6=\"By Rows\", \"C2\", \"B4\")","v":"B4"}]
[null,{"$f":"IF($C$6=\"By Rows\", \"C3\", \"C4\")","v":"C4"}]
[null,{"$f":"IF($C$6=\"By Rows\", \"C4\", \"D4\")","v":"D4"}]
[null,{"$f":"IF($C$6=\"By Rows\", \"C5\", \"E4\")","v":"E4"}]
[null,{"$f":"IF($C$6=\"By Rows\", \"C6\", \"F4\")","v":"F4"}]
[null,{"$f":"IF($C$6=\"By Rows\", \"C7\", \"G4\")","v":"G4"}]
[null,{"$f":"IF($C$6=\"By Rows\", \"C8\", \"H4\")","v":"H4"}]
[null,{"$f":"IF($C$6=\"By Rows\", \"C9\", \"A5\")","v":"A5"}]
[null,{"$f":"IF($C$6=\"By Rows\", \"C10\", \"B5\")","v":"B5"}]
[null,{"$f":"IF($C$6=\"By Rows\", \"C11\", \"C5\")","v":"C5"}]
[null,{"$f":"IF($C$6=\"By Rows\", \"C12\", \"D5\")","v":"D5"}]
[null,{"$f":"IF($C$6=\"By Rows\", \"D1\", \"E5\")","v":"E5"}]
[null,{"$f":"IF($C$6=\"By Rows\", \"D2\", \"F5\")","v":"F5"}]
[null,{"$f":"IF($C$6=\"By Rows\", \"D3\", \"G5\")","v":"G5"}]
[null,{"$f":"IF($C$6=\"By Rows\", \"D4\", \"H5\")","v":"H5"}]
[null,{"$f":"IF($C$6=\"By Rows\", \"D5\", \"A6\")","v":"A6"}]
[null,{"$f":"IF($C$6=\"By Rows\", \"D6\", \"B6\")","v":"B6"}]
[null,{"$f":"IF($C$6=\"By Rows\", \"D7\", \"C6\")","v":"C6"}]
[null,{"$f":"IF($C$6=\"By Rows\", \"D8\", \"D6\")","v":"D6"}]
[null,{"$f":"IF($C$6=\"By Rows\", \"D9\", \"E6\")","v":"E6"}]
[null,{"$f":"IF($C$6=\"By Rows\", \"D10\", \"F6\")","v":"F6"}]
[null,{"$f":"IF($C$6=\"By Rows\", \"D11\", \"G6\")","v":"G6"}]
[null,{"$f":"IF($C$6=\"By Rows\", \"D12\", \"H6\")","v":"H6"}]
[null,{"$f":"IF($C$6=\"By Rows\", \"E1\", \"A7\")","v":"A7"}]
[null,{"$f":"IF($C$6=\"By Rows\", \"E2\", \"B7\")","v":"B7"}]
[null,{"$f":"IF($C$6=\"By Rows\", \"E3\", \"C7\")","v":"C7"}]
[null,{"$f":"IF($C$6=\"By Rows\", \"E4\", \"D7\")","v":"D7"}]
[null,{"$f":"IF($C$6=\"By Rows\", \"E5\", \"E7\")","v":"E7"}]
[null,{"$f":"IF($C$6=\"By Rows\", \"E6\", \"F7\")","v":"F7"}]
[null,{"$f":"IF($C$6=\"By Rows\", \"E7\", \"G7\")","v":"G7"}]
[null,{"$f":"IF($C$6=\"By Rows\", \"E8\", \"H7\")","v":"H7"}]
[null,{"$f":"IF($C$6=\"By Rows\", \"E9\", \"A8\")","v":"A8"}]
[null,{"$f":"IF($C$6=\"By Rows\", \"E10\", \"B8\")","v":"B8"}]
[null,{"$f":"IF($C$6=\"By Rows\", \"E11\", \"C8\")","v":"C8"}]
[null,{"$f":"IF($C$6=\"By Rows\", \"E12\", \"D8\")","v":"D8"}]
[null,{"$f":"IF($C$6=\"By Rows\", \"F1\", \"E8\")","v":"E8"}]
[null,{"$f":"IF($C$6=\"By Rows\", \"F2\", \"F8\")","v":"F8"}]
[null,{"$f":"IF($C$6=\"By Rows\", \"F3\", \"G8\")","v":"G8"}]
[null,{"$f":"IF($C$6=\"By Rows\", \"F4\", \"H8\")","v":"H8"}]
[null,{"$f":"IF($C$6=\"By Rows\", \"F5\", \"A9\")","v":"A9"}]
[null,{"$f":"IF($C$6=\"By Rows\", \"F6\", \"B9\")","v":"B9"}]
[null,{"$f":"IF($C$6=\"By Rows\", \"F7\", \"C9\")","v":"C9"}]
[null,{"$f":"IF($C$6=\"By Rows\", \"F8\", \"D9\")","v":"D9"}]
[null,{"$f":"IF($C$6=\"By Rows\", \"F9\", \"E9\")","v":"E9"}]
[null,{"$f":"IF($C$6=\"By Rows\", \"F10\", \"F9\")","v":"F9"}]
[null,{"$f":"IF($C$6=\"By Rows\", \"F11\", \"G9\")","v":"G9"}]
[null,{"$f":"IF($C$6=\"By Rows\", \"F12\", \"H9\")","v":"H9"}]
[null,{"$f":"IF($C$6=\"By Rows\", \"G1\", \"A10\")","v":"A10"}]
[null,{"$f":"IF($C$6=\"By Rows\", \"G2\", \"B10\")","v":"B10"}]
[null,{"$f":"IF($C$6=\"By Rows\", \"G3\", \"C10\")","v":"C10"}]
[null,{"$f":"IF($C$6=\"By Rows\", \"G4\", \"D10\")","v":"D10"}]
[null,{"$f":"IF($C$6=\"By Rows\", \"G5\", \"E10\")","v":"E10"}]
[null,{"$f":"IF($C$6=\"By Rows\", \"G6\", \"F10\")","v":"F10"}]
[null,{"$f":"IF($C$6=\"By Rows\", \"G7\", \"G10\")","v":"G10"}]
[null,{"$f":"IF($C$6=\"By Rows\", \"G8\", \"H10\")","v":"H10"}]
[null,{"$f":"IF($C$6=\"By Rows\", \"G9\", \"A11\")","v":"A11"}]
[null,{"$f":"IF($C$6=\"By Rows\", \"G10\", \"B11\")","v":"B11"}]
[null,{"$f":"IF($C$6=\"By Rows\", \"G11\", \"C11\")","v":"C11"}]
[null,{"$f":"IF($C$6=\"By Rows\", \"G12\", \"D11\")","v":"D11"}]
[null,{"$f":"IF($C$6=\"By Rows\", \"H1\", \"E11\")","v":"E11"}]
[null,{"$f":"IF($C$6=\"By Rows\", \"H2\", \"F11\")","v":"F11"}]
[null,{"$f":"IF($C$6=\"By Rows\", \"H3\", \"G11\")","v":"G11"}]
[null,{"$f":"IF($C$6=\"By Rows\", \"H4\", \"H11\")","v":"H11"}]
[null,{"$f":"IF($C$6=\"By Rows\", \"H5\", \"A12\")","v":"A12"}]
[null,{"$f":"IF($C$6=\"By Rows\", \"H6\", \"B12\")","v":"B12"}]
[null,{"$f":"IF($C$6=\"By Rows\", \"H7\", \"C12\")","v":"C12"}]
[null,{"$f":"IF($C$6=\"By Rows\", \"H8\", \"D12\")","v":"D12"}]
[null,{"$f":"IF($C$6=\"By Rows\", \"H9\", \"E12\")","v":"E12"}]
[null,{"$f":"IF($C$6=\"By Rows\", \"H10\", \"F12\")","v":"F12"}]
[null,{"$f":"IF($C$6=\"By Rows\", \"H11\", \"G12\")","v":"G12"}]
[null,"H12"]

{"sheet":"Plate06","index":7,"n_rows":105,"n_cols":3,"rows_kept":105,"cut":false,"hidden":false,"merged":[[4,1,4,2]]}
[]
[null,"Whole Plasmid Sequencing"]
[null,"Upload form"]
[]
[null,"Plate Information"]
[null,"Sort Plate:","By Columns"]
[]
[]
[null,"Well Position","Sample Name"]
[null,"A1"]
[null,{"$f":"IF($C$6=\"By Rows\", \"A2\", \"B1\")","v":"B1"}]
[null,{"$f":"IF($C$6=\"By Rows\", \"A3\", \"C1\")","v":"C1"}]
[null,{"$f":"IF($C$6=\"By Rows\", \"A4\", \"D1\")","v":"D1"}]
[null,{"$f":"IF($C$6=\"By Rows\", \"A5\", \"E1\")","v":"E1"}]
[null,{"$f":"IF($C$6=\"By Rows\", \"A6\", \"F1\")","v":"F1"}]
[null,{"$f":"IF($C$6=\"By Rows\", \"A7\", \"G1\")","v":"G1"}]
[null,{"$f":"IF($C$6=\"By Rows\", \"A8\", \"H1\")","v":"H1"}]
[null,{"$f":"IF($C$6=\"By Rows\", \"A9\", \"A2\")","v":"A2"}]
[null,{"$f":"IF($C$6=\"By Rows\", \"A10\", \"B2\")","v":"B2"}]
[null,{"$f":"IF($C$6=\"By Rows\", \"A11\", \"C2\")","v":"C2"}]
[null,{"$f":"IF($C$6=\"By Rows\", \"A12\", \"D2\")","v":"D2"}]
[null,{"$f":"IF($C$6=\"By Rows\", \"B1\", \"E2\")","v":"E2"}]
[null,{"$f":"IF($C$6=\"By Rows\", \"B2\", \"F2\")","v":"F2"}]
[null,{"$f":"IF($C$6=\"By Rows\", \"B3\", \"G2\")","v":"G2"}]
[null,{"$f":"IF($C$6=\"By Rows\", \"B4\", \"H2\")","v":"H2"}]
[null,{"$f":"IF($C$6=\"By Rows\", \"B5\", \"A3\")","v":"A3"}]
[null,{"$f":"IF($C$6=\"By Rows\", \"B6\", \"B3\")","v":"B3"}]
[null,{"$f":"IF($C$6=\"By Rows\", \"B7\", \"C3\")","v":"C3"}]
[null,{"$f":"IF($C$6=\"By Rows\", \"B8\", \"D3\")","v":"D3"}]
[null,{"$f":"IF($C$6=\"By Rows\", \"B9\", \"E3\")","v":"E3"}]
[null,{"$f":"IF($C$6=\"By Rows\", \"B10\", \"F3\")","v":"F3"}]
[null,{"$f":"IF($C$6=\"By Rows\", \"B11\", \"G3\")","v":"G3"}]
[null,{"$f":"IF($C$6=\"By Rows\", \"B12\", \"H3\")","v":"H3"}]
[null,{"$f":"IF($C$6=\"By Rows\", \"C1\", \"A4\")","v":"A4"}]
[null,{"$f":"IF($C$6=\"By Rows\", \"C2\", \"B4\")","v":"B4"}]
[null,{"$f":"IF($C$6=\"By Rows\", \"C3\", \"C4\")","v":"C4"}]
[null,{"$f":"IF($C$6=\"By Rows\", \"C4\", \"D4\")","v":"D4"}]
[null,{"$f":"IF($C$6=\"By Rows\", \"C5\", \"E4\")","v":"E4"}]
[null,{"$f":"IF($C$6=\"By Rows\", \"C6\", \"F4\")","v":"F4"}]
[null,{"$f":"IF($C$6=\"By Rows\", \"C7\", \"G4\")","v":"G4"}]
[null,{"$f":"IF($C$6=\"By Rows\", \"C8\", \"H4\")","v":"H4"}]
[null,{"$f":"IF($C$6=\"By Rows\", \"C9\", \"A5\")","v":"A5"}]
[null,{"$f":"IF($C$6=\"By Rows\", \"C10\", \"B5\")","v":"B5"}]
[null,{"$f":"IF($C$6=\"By Rows\", \"C11\", \"C5\")","v":"C5"}]
[null,{"$f":"IF($C$6=\"By Rows\", \"C12\", \"D5\")","v":"D5"}]
[null,{"$f":"IF($C$6=\"By Rows\", \"D1\", \"E5\")","v":"E5"}]
[null,{"$f":"IF($C$6=\"By Rows\", \"D2\", \"F5\")","v":"F5"}]
[null,{"$f":"IF($C$6=\"By Rows\", \"D3\", \"G5\")","v":"G5"}]
[null,{"$f":"IF($C$6=\"By Rows\", \"D4\", \"H5\")","v":"H5"}]
[null,{"$f":"IF($C$6=\"By Rows\", \"D5\", \"A6\")","v":"A6"}]
[null,{"$f":"IF($C$6=\"By Rows\", \"D6\", \"B6\")","v":"B6"}]
[null,{"$f":"IF($C$6=\"By Rows\", \"D7\", \"C6\")","v":"C6"}]
[null,{"$f":"IF($C$6=\"By Rows\", \"D8\", \"D6\")","v":"D6"}]
[null,{"$f":"IF($C$6=\"By Rows\", \"D9\", \"E6\")","v":"E6"}]
[null,{"$f":"IF($C$6=\"By Rows\", \"D10\", \"F6\")","v":"F6"}]
[null,{"$f":"IF($C$6=\"By Rows\", \"D11\", \"G6\")","v":"G6"}]
[null,{"$f":"IF($C$6=\"By Rows\", \"D12\", \"H6\")","v":"H6"}]
[null,{"$f":"IF($C$6=\"By Rows\", \"E1\", \"A7\")","v":"A7"}]
[null,{"$f":"IF($C$6=\"By Rows\", \"E2\", \"B7\")","v":"B7"}]
[null,{"$f":"IF($C$6=\"By Rows\", \"E3\", \"C7\")","v":"C7"}]
[null,{"$f":"IF($C$6=\"By Rows\", \"E4\", \"D7\")","v":"D7"}]
[null,{"$f":"IF($C$6=\"By Rows\", \"E5\", \"E7\")","v":"E7"}]
[null,{"$f":"IF($C$6=\"By Rows\", \"E6\", \"F7\")","v":"F7"}]
[null,{"$f":"IF($C$6=\"By Rows\", \"E7\", \"G7\")","v":"G7"}]
[null,{"$f":"IF($C$6=\"By Rows\", \"E8\", \"H7\")","v":"H7"}]
[null,{"$f":"IF($C$6=\"By Rows\", \"E9\", \"A8\")","v":"A8"}]
[null,{"$f":"IF($C$6=\"By Rows\", \"E10\", \"B8\")","v":"B8"}]
[null,{"$f":"IF($C$6=\"By Rows\", \"E11\", \"C8\")","v":"C8"}]
[null,{"$f":"IF($C$6=\"By Rows\", \"E12\", \"D8\")","v":"D8"}]
[null,{"$f":"IF($C$6=\"By Rows\", \"F1\", \"E8\")","v":"E8"}]
[null,{"$f":"IF($C$6=\"By Rows\", \"F2\", \"F8\")","v":"F8"}]
[null,{"$f":"IF($C$6=\"By Rows\", \"F3\", \"G8\")","v":"G8"}]
[null,{"$f":"IF($C$6=\"By Rows\", \"F4\", \"H8\")","v":"H8"}]
[null,{"$f":"IF($C$6=\"By Rows\", \"F5\", \"A9\")","v":"A9"}]
[null,{"$f":"IF($C$6=\"By Rows\", \"F6\", \"B9\")","v":"B9"}]
[null,{"$f":"IF($C$6=\"By Rows\", \"F7\", \"C9\")","v":"C9"}]
[null,{"$f":"IF($C$6=\"By Rows\", \"F8\", \"D9\")","v":"D9"}]
[null,{"$f":"IF($C$6=\"By Rows\", \"F9\", \"E9\")","v":"E9"}]
[null,{"$f":"IF($C$6=\"By Rows\", \"F10\", \"F9\")","v":"F9"}]
[null,{"$f":"IF($C$6=\"By Rows\", \"F11\", \"G9\")","v":"G9"}]
[null,{"$f":"IF($C$6=\"By Rows\", \"F12\", \"H9\")","v":"H9"}]
[null,{"$f":"IF($C$6=\"By Rows\", \"G1\", \"A10\")","v":"A10"}]
[null,{"$f":"IF($C$6=\"By Rows\", \"G2\", \"B10\")","v":"B10"}]
[null,{"$f":"IF($C$6=\"By Rows\", \"G3\", \"C10\")","v":"C10"}]
[null,{"$f":"IF($C$6=\"By Rows\", \"G4\", \"D10\")","v":"D10"}]
[null,{"$f":"IF($C$6=\"By Rows\", \"G5\", \"E10\")","v":"E10"}]
[null,{"$f":"IF($C$6=\"By Rows\", \"G6\", \"F10\")","v":"F10"}]
[null,{"$f":"IF($C$6=\"By Rows\", \"G7\", \"G10\")","v":"G10"}]
[null,{"$f":"IF($C$6=\"By Rows\", \"G8\", \"H10\")","v":"H10"}]
[null,{"$f":"IF($C$6=\"By Rows\", \"G9\", \"A11\")","v":"A11"}]
[null,{"$f":"IF($C$6=\"By Rows\", \"G10\", \"B11\")","v":"B11"}]
[null,{"$f":"IF($C$6=\"By Rows\", \"G11\", \"C11\")","v":"C11"}]
[null,{"$f":"IF($C$6=\"By Rows\", \"G12\", \"D11\")","v":"D11"}]
[null,{"$f":"IF($C$6=\"By Rows\", \"H1\", \"E11\")","v":"E11"}]
[null,{"$f":"IF($C$6=\"By Rows\", \"H2\", \"F11\")","v":"F11"}]
[null,{"$f":"IF($C$6=\"By Rows\", \"H3\", \"G11\")","v":"G11"}]
[null,{"$f":"IF($C$6=\"By Rows\", \"H4\", \"H11\")","v":"H11"}]
[null,{"$f":"IF($C$6=\"By Rows\", \"H5\", \"A12\")","v":"A12"}]
[null,{"$f":"IF($C$6=\"By Rows\", \"H6\", \"B12\")","v":"B12"}]
[null,{"$f":"IF($C$6=\"By Rows\", \"H7\", \"C12\")","v":"C12"}]
[null,{"$f":"IF($C$6=\"By Rows\", \"H8\", \"D12\")","v":"D12"}]
[null,{"$f":"IF($C$6=\"By Rows\", \"H9\", \"E12\")","v":"E12"}]
[null,{"$f":"IF($C$6=\"By Rows\", \"H10\", \"F12\")","v":"F12"}]
[null,{"$f":"IF($C$6=\"By Rows\", \"H11\", \"G12\")","v":"G12"}]
[null,"H12"]

{"sheet":"Plate07","index":8,"n_rows":105,"n_cols":3,"rows_kept":105,"cut":false,"hidden":false,"merged":[[4,1,4,2]]}
[]
[null,"Whole Plasmid Sequencing"]
[null,"Upload form"]
[]
[null,"Plate Information"]
[null,"Sort Plate:","By Columns"]
[]
[]
[null,"Well Position","Sample Name"]
[null,"A1"]
[null,{"$f":"IF($C$6=\"By Rows\", \"A2\", \"B1\")","v":"B1"}]
[null,{"$f":"IF($C$6=\"By Rows\", \"A3\", \"C1\")","v":"C1"}]
[null,{"$f":"IF($C$6=\"By Rows\", \"A4\", \"D1\")","v":"D1"}]
[null,{"$f":"IF($C$6=\"By Rows\", \"A5\", \"E1\")","v":"E1"}]
[null,{"$f":"IF($C$6=\"By Rows\", \"A6\", \"F1\")","v":"F1"}]
[null,{"$f":"IF($C$6=\"By Rows\", \"A7\", \"G1\")","v":"G1"}]
[null,{"$f":"IF($C$6=\"By Rows\", \"A8\", \"H1\")","v":"H1"}]
[null,{"$f":"IF($C$6=\"By Rows\", \"A9\", \"A2\")","v":"A2"}]
[null,{"$f":"IF($C$6=\"By Rows\", \"A10\", \"B2\")","v":"B2"}]
[null,{"$f":"IF($C$6=\"By Rows\", \"A11\", \"C2\")","v":"C2"}]
[null,{"$f":"IF($C$6=\"By Rows\", \"A12\", \"D2\")","v":"D2"}]
[null,{"$f":"IF($C$6=\"By Rows\", \"B1\", \"E2\")","v":"E2"}]
[null,{"$f":"IF($C$6=\"By Rows\", \"B2\", \"F2\")","v":"F2"}]
[null,{"$f":"IF($C$6=\"By Rows\", \"B3\", \"G2\")","v":"G2"}]
[null,{"$f":"IF($C$6=\"By Rows\", \"B4\", \"H2\")","v":"H2"}]
[null,{"$f":"IF($C$6=\"By Rows\", \"B5\", \"A3\")","v":"A3"}]
[null,{"$f":"IF($C$6=\"By Rows\", \"B6\", \"B3\")","v":"B3"}]
[null,{"$f":"IF($C$6=\"By Rows\", \"B7\", \"C3\")","v":"C3"}]
[null,{"$f":"IF($C$6=\"By Rows\", \"B8\", \"D3\")","v":"D3"}]
[null,{"$f":"IF($C$6=\"By Rows\", \"B9\", \"E3\")","v":"E3"}]
[null,{"$f":"IF($C$6=\"By Rows\", \"B10\", \"F3\")","v":"F3"}]
[null,{"$f":"IF($C$6=\"By Rows\", \"B11\", \"G3\")","v":"G3"}]
[null,{"$f":"IF($C$6=\"By Rows\", \"B12\", \"H3\")","v":"H3"}]
[null,{"$f":"IF($C$6=\"By Rows\", \"C1\", \"A4\")","v":"A4"}]
[null,{"$f":"IF($C$6=\"By Rows\", \"C2\", \"B4\")","v":"B4"}]
[null,{"$f":"IF($C$6=\"By Rows\", \"C3\", \"C4\")","v":"C4"}]
[null,{"$f":"IF($C$6=\"By Rows\", \"C4\", \"D4\")","v":"D4"}]
[null,{"$f":"IF($C$6=\"By Rows\", \"C5\", \"E4\")","v":"E4"}]
[null,{"$f":"IF($C$6=\"By Rows\", \"C6\", \"F4\")","v":"F4"}]
[null,{"$f":"IF($C$6=\"By Rows\", \"C7\", \"G4\")","v":"G4"}]
[null,{"$f":"IF($C$6=\"By Rows\", \"C8\", \"H4\")","v":"H4"}]
[null,{"$f":"IF($C$6=\"By Rows\", \"C9\", \"A5\")","v":"A5"}]
[null,{"$f":"IF($C$6=\"By Rows\", \"C10\", \"B5\")","v":"B5"}]
[null,{"$f":"IF($C$6=\"By Rows\", \"C11\", \"C5\")","v":"C5"}]
[null,{"$f":"IF($C$6=\"By Rows\", \"C12\", \"D5\")","v":"D5"}]
[null,{"$f":"IF($C$6=\"By Rows\", \"D1\", \"E5\")","v":"E5"}]
[null,{"$f":"IF($C$6=\"By Rows\", \"D2\", \"F5\")","v":"F5"}]
[null,{"$f":"IF($C$6=\"By Rows\", \"D3\", \"G5\")","v":"G5"}]
[null,{"$f":"IF($C$6=\"By Rows\", \"D4\", \"H5\")","v":"H5"}]
[null,{"$f":"IF($C$6=\"By Rows\", \"D5\", \"A6\")","v":"A6"}]
[null,{"$f":"IF($C$6=\"By Rows\", \"D6\", \"B6\")","v":"B6"}]
[null,{"$f":"IF($C$6=\"By Rows\", \"D7\", \"C6\")","v":"C6"}]
[null,{"$f":"IF($C$6=\"By Rows\", \"D8\", \"D6\")","v":"D6"}]
[null,{"$f":"IF($C$6=\"By Rows\", \"D9\", \"E6\")","v":"E6"}]
[null,{"$f":"IF($C$6=\"By Rows\", \"D10\", \"F6\")","v":"F6"}]
[null,{"$f":"IF($C$6=\"By Rows\", \"D11\", \"G6\")","v":"G6"}]
[null,{"$f":"IF($C$6=\"By Rows\", \"D12\", \"H6\")","v":"H6"}]
[null,{"$f":"IF($C$6=\"By Rows\", \"E1\", \"A7\")","v":"A7"}]
[null,{"$f":"IF($C$6=\"By Rows\", \"E2\", \"B7\")","v":"B7"}]
[null,{"$f":"IF($C$6=\"By Rows\", \"E3\", \"C7\")","v":"C7"}]
[null,{"$f":"IF($C$6=\"By Rows\", \"E4\", \"D7\")","v":"D7"}]
[null,{"$f":"IF($C$6=\"By Rows\", \"E5\", \"E7\")","v":"E7"}]
[null,{"$f":"IF($C$6=\"By Rows\", \"E6\", \"F7\")","v":"F7"}]
[null,{"$f":"IF($C$6=\"By Rows\", \"E7\", \"G7\")","v":"G7"}]
[null,{"$f":"IF($C$6=\"By Rows\", \"E8\", \"H7\")","v":"H7"}]
[null,{"$f":"IF($C$6=\"By Rows\", \"E9\", \"A8\")","v":"A8"}]
[null,{"$f":"IF($C$6=\"By Rows\", \"E10\", \"B8\")","v":"B8"}]
[null,{"$f":"IF($C$6=\"By Rows\", \"E11\", \"C8\")","v":"C8"}]
[null,{"$f":"IF($C$6=\"By Rows\", \"E12\", \"D8\")","v":"D8"}]
[null,{"$f":"IF($C$6=\"By Rows\", \"F1\", \"E8\")","v":"E8"}]
[null,{"$f":"IF($C$6=\"By Rows\", \"F2\", \"F8\")","v":"F8"}]
[null,{"$f":"IF($C$6=\"By Rows\", \"F3\", \"G8\")","v":"G8"}]
[null,{"$f":"IF($C$6=\"By Rows\", \"F4\", \"H8\")","v":"H8"}]
[null,{"$f":"IF($C$6=\"By Rows\", \"F5\", \"A9\")","v":"A9"}]
[null,{"$f":"IF($C$6=\"By Rows\", \"F6\", \"B9\")","v":"B9"}]
[null,{"$f":"IF($C$6=\"By Rows\", \"F7\", \"C9\")","v":"C9"}]
[null,{"$f":"IF($C$6=\"By Rows\", \"F8\", \"D9\")","v":"D9"}]
[null,{"$f":"IF($C$6=\"By Rows\", \"F9\", \"E9\")","v":"E9"}]
[null,{"$f":"IF($C$6=\"By Rows\", \"F10\", \"F9\")","v":"F9"}]
[null,{"$f":"IF($C$6=\"By Rows\", \"F11\", \"G9\")","v":"G9"}]
[null,{"$f":"IF($C$6=\"By Rows\", \"F12\", \"H9\")","v":"H9"}]
[null,{"$f":"IF($C$6=\"By Rows\", \"G1\", \"A10\")","v":"A10"}]
[null,{"$f":"IF($C$6=\"By Rows\", \"G2\", \"B10\")","v":"B10"}]
[null,{"$f":"IF($C$6=\"By Rows\", \"G3\", \"C10\")","v":"C10"}]
[null,{"$f":"IF($C$6=\"By Rows\", \"G4\", \"D10\")","v":"D10"}]
[null,{"$f":"IF($C$6=\"By Rows\", \"G5\", \"E10\")","v":"E10"}]
[null,{"$f":"IF($C$6=\"By Rows\", \"G6\", \"F10\")","v":"F10"}]
[null,{"$f":"IF($C$6=\"By Rows\", \"G7\", \"G10\")","v":"G10"}]
[null,{"$f":"IF($C$6=\"By Rows\", \"G8\", \"H10\")","v":"H10"}]
[null,{"$f":"IF($C$6=\"By Rows\", \"G9\", \"A11\")","v":"A11"}]
[null,{"$f":"IF($C$6=\"By Rows\", \"G10\", \"B11\")","v":"B11"}]
[null,{"$f":"IF($C$6=\"By Rows\", \"G11\", \"C11\")","v":"C11"}]
[null,{"$f":"IF($C$6=\"By Rows\", \"G12\", \"D11\")","v":"D11"}]
[null,{"$f":"IF($C$6=\"By Rows\", \"H1\", \"E11\")","v":"E11"}]
[null,{"$f":"IF($C$6=\"By Rows\", \"H2\", \"F11\")","v":"F11"}]
[null,{"$f":"IF($C$6=\"By Rows\", \"H3\", \"G11\")","v":"G11"}]
[null,{"$f":"IF($C$6=\"By Rows\", \"H4\", \"H11\")","v":"H11"}]
[null,{"$f":"IF($C$6=\"By Rows\", \"H5\", \"A12\")","v":"A12"}]
[null,{"$f":"IF($C$6=\"By Rows\", \"H6\", \"B12\")","v":"B12"}]
[null,{"$f":"IF($C$6=\"By Rows\", \"H7\", \"C12\")","v":"C12"}]
[null,{"$f":"IF($C$6=\"By Rows\", \"H8\", \"D12\")","v":"D12"}]
[null,{"$f":"IF($C$6=\"By Rows\", \"H9\", \"E12\")","v":"E12"}]
[null,{"$f":"IF($C$6=\"By Rows\", \"H10\", \"F12\")","v":"F12"}]
[null,{"$f":"IF($C$6=\"By Rows\", \"H11\", \"G12\")","v":"G12"}]
[null,"H12"]

{"sheet":"Plate08","index":9,"n_rows":105,"n_cols":3,"rows_kept":105,"cut":false,"hidden":false,"merged":[[4,1,4,2]]}
[]
[null,"Whole Plasmid Sequencing"]
[null,"Upload form"]
[]
[null,"Plate Information"]
[null,"Sort Plate:","By Columns"]
[]
[]
[null,"Well Position","Sample Name"]
[null,"A1"]
[null,{"$f":"IF($C$6=\"By Rows\", \"A2\", \"B1\")","v":"B1"}]
[null,{"$f":"IF($C$6=\"By Rows\", \"A3\", \"C1\")","v":"C1"}]
[null,{"$f":"IF($C$6=\"By Rows\", \"A4\", \"D1\")","v":"D1"}]
[null,{"$f":"IF($C$6=\"By Rows\", \"A5\", \"E1\")","v":"E1"}]
[null,{"$f":"IF($C$6=\"By Rows\", \"A6\", \"F1\")","v":"F1"}]
[null,{"$f":"IF($C$6=\"By Rows\", \"A7\", \"G1\")","v":"G1"}]
[null,{"$f":"IF($C$6=\"By Rows\", \"A8\", \"H1\")","v":"H1"}]
[null,{"$f":"IF($C$6=\"By Rows\", \"A9\", \"A2\")","v":"A2"}]
[null,{"$f":"IF($C$6=\"By Rows\", \"A10\", \"B2\")","v":"B2"}]
[null,{"$f":"IF($C$6=\"By Rows\", \"A11\", \"C2\")","v":"C2"}]
[null,{"$f":"IF($C$6=\"By Rows\", \"A12\", \"D2\")","v":"D2"}]
[null,{"$f":"IF($C$6=\"By Rows\", \"B1\", \"E2\")","v":"E2"}]
[null,{"$f":"IF($C$6=\"By Rows\", \"B2\", \"F2\")","v":"F2"}]
[null,{"$f":"IF($C$6=\"By Rows\", \"B3\", \"G2\")","v":"G2"}]
[null,{"$f":"IF($C$6=\"By Rows\", \"B4\", \"H2\")","v":"H2"}]
[null,{"$f":"IF($C$6=\"By Rows\", \"B5\", \"A3\")","v":"A3"}]
[null,{"$f":"IF($C$6=\"By Rows\", \"B6\", \"B3\")","v":"B3"}]
[null,{"$f":"IF($C$6=\"By Rows\", \"B7\", \"C3\")","v":"C3"}]
[null,{"$f":"IF($C$6=\"By Rows\", \"B8\", \"D3\")","v":"D3"}]
[null,{"$f":"IF($C$6=\"By Rows\", \"B9\", \"E3\")","v":"E3"}]
[null,{"$f":"IF($C$6=\"By Rows\", \"B10\", \"F3\")","v":"F3"}]
[null,{"$f":"IF($C$6=\"By Rows\", \"B11\", \"G3\")","v":"G3"}]
[null,{"$f":"IF($C$6=\"By Rows\", \"B12\", \"H3\")","v":"H3"}]
[null,{"$f":"IF($C$6=\"By Rows\", \"C1\", \"A4\")","v":"A4"}]
[null,{"$f":"IF($C$6=\"By Rows\", \"C2\", \"B4\")","v":"B4"}]
[null,{"$f":"IF($C$6=\"By Rows\", \"C3\", \"C4\")","v":"C4"}]
[null,{"$f":"IF($C$6=\"By Rows\", \"C4\", \"D4\")","v":"D4"}]
[null,{"$f":"IF($C$6=\"By Rows\", \"C5\", \"E4\")","v":"E4"}]
[null,{"$f":"IF($C$6=\"By Rows\", \"C6\", \"F4\")","v":"F4"}]
[null,{"$f":"IF($C$6=\"By Rows\", \"C7\", \"G4\")","v":"G4"}]
[null,{"$f":"IF($C$6=\"By Rows\", \"C8\", \"H4\")","v":"H4"}]
[null,{"$f":"IF($C$6=\"By Rows\", \"C9\", \"A5\")","v":"A5"}]
[null,{"$f":"IF($C$6=\"By Rows\", \"C10\", \"B5\")","v":"B5"}]
[null,{"$f":"IF($C$6=\"By Rows\", \"C11\", \"C5\")","v":"C5"}]
[null,{"$f":"IF($C$6=\"By Rows\", \"C12\", \"D5\")","v":"D5"}]
[null,{"$f":"IF($C$6=\"By Rows\", \"D1\", \"E5\")","v":"E5"}]
[null,{"$f":"IF($C$6=\"By Rows\", \"D2\", \"F5\")","v":"F5"}]
[null,{"$f":"IF($C$6=\"By Rows\", \"D3\", \"G5\")","v":"G5"}]
[null,{"$f":"IF($C$6=\"By Rows\", \"D4\", \"H5\")","v":"H5"}]
[null,{"$f":"IF($C$6=\"By Rows\", \"D5\", \"A6\")","v":"A6"}]
[null,{"$f":"IF($C$6=\"By Rows\", \"D6\", \"B6\")","v":"B6"}]
[null,{"$f":"IF($C$6=\"By Rows\", \"D7\", \"C6\")","v":"C6"}]
[null,{"$f":"IF($C$6=\"By Rows\", \"D8\", \"D6\")","v":"D6"}]
[null,{"$f":"IF($C$6=\"By Rows\", \"D9\", \"E6\")","v":"E6"}]
[null,{"$f":"IF($C$6=\"By Rows\", \"D10\", \"F6\")","v":"F6"}]
[null,{"$f":"IF($C$6=\"By Rows\", \"D11\", \"G6\")","v":"G6"}]
[null,{"$f":"IF($C$6=\"By Rows\", \"D12\", \"H6\")","v":"H6"}]
[null,{"$f":"IF($C$6=\"By Rows\", \"E1\", \"A7\")","v":"A7"}]
[null,{"$f":"IF($C$6=\"By Rows\", \"E2\", \"B7\")","v":"B7"}]
[null,{"$f":"IF($C$6=\"By Rows\", \"E3\", \"C7\")","v":"C7"}]
[null,{"$f":"IF($C$6=\"By Rows\", \"E4\", \"D7\")","v":"D7"}]
[null,{"$f":"IF($C$6=\"By Rows\", \"E5\", \"E7\")","v":"E7"}]
[null,{"$f":"IF($C$6=\"By Rows\", \"E6\", \"F7\")","v":"F7"}]
[null,{"$f":"IF($C$6=\"By Rows\", \"E7\", \"G7\")","v":"G7"}]
[null,{"$f":"IF($C$6=\"By Rows\", \"E8\", \"H7\")","v":"H7"}]
[null,{"$f":"IF($C$6=\"By Rows\", \"E9\", \"A8\")","v":"A8"}]
[null,{"$f":"IF($C$6=\"By Rows\", \"E10\", \"B8\")","v":"B8"}]
[null,{"$f":"IF($C$6=\"By Rows\", \"E11\", \"C8\")","v":"C8"}]
[null,{"$f":"IF($C$6=\"By Rows\", \"E12\", \"D8\")","v":"D8"}]
[null,{"$f":"IF($C$6=\"By Rows\", \"F1\", \"E8\")","v":"E8"}]
[null,{"$f":"IF($C$6=\"By Rows\", \"F2\", \"F8\")","v":"F8"}]
[null,{"$f":"IF($C$6=\"By Rows\", \"F3\", \"G8\")","v":"G8"}]
[null,{"$f":"IF($C$6=\"By Rows\", \"F4\", \"H8\")","v":"H8"}]
[null,{"$f":"IF($C$6=\"By Rows\", \"F5\", \"A9\")","v":"A9"}]
[null,{"$f":"IF($C$6=\"By Rows\", \"F6\", \"B9\")","v":"B9"}]
[null,{"$f":"IF($C$6=\"By Rows\", \"F7\", \"C9\")","v":"C9"}]
[null,{"$f":"IF($C$6=\"By Rows\", \"F8\", \"D9\")","v":"D9"}]
[null,{"$f":"IF($C$6=\"By Rows\", \"F9\", \"E9\")","v":"E9"}]
[null,{"$f":"IF($C$6=\"By Rows\", \"F10\", \"F9\")","v":"F9"}]
[null,{"$f":"IF($C$6=\"By Rows\", \"F11\", \"G9\")","v":"G9"}]
[null,{"$f":"IF($C$6=\"By Rows\", \"F12\", \"H9\")","v":"H9"}]
[null,{"$f":"IF($C$6=\"By Rows\", \"G1\", \"A10\")","v":"A10"}]
[null,{"$f":"IF($C$6=\"By Rows\", \"G2\", \"B10\")","v":"B10"}]
[null,{"$f":"IF($C$6=\"By Rows\", \"G3\", \"C10\")","v":"C10"}]
[null,{"$f":"IF($C$6=\"By Rows\", \"G4\", \"D10\")","v":"D10"}]
[null,{"$f":"IF($C$6=\"By Rows\", \"G5\", \"E10\")","v":"E10"}]
[null,{"$f":"IF($C$6=\"By Rows\", \"G6\", \"F10\")","v":"F10"}]
[null,{"$f":"IF($C$6=\"By Rows\", \"G7\", \"G10\")","v":"G10"}]
[null,{"$f":"IF($C$6=\"By Rows\", \"G8\", \"H10\")","v":"H10"}]
[null,{"$f":"IF($C$6=\"By Rows\", \"G9\", \"A11\")","v":"A11"}]
[null,{"$f":"IF($C$6=\"By Rows\", \"G10\", \"B11\")","v":"B11"}]
[null,{"$f":"IF($C$6=\"By Rows\", \"G11\", \"C11\")","v":"C11"}]
[null,{"$f":"IF($C$6=\"By Rows\", \"G12\", \"D11\")","v":"D11"}]
[null,{"$f":"IF($C$6=\"By Rows\", \"H1\", \"E11\")","v":"E11"}]
[null,{"$f":"IF($C$6=\"By Rows\", \"H2\", \"F11\")","v":"F11"}]
[null,{"$f":"IF($C$6=\"By Rows\", \"H3\", \"G11\")","v":"G11"}]
[null,{"$f":"IF($C$6=\"By Rows\", \"H4\", \"H11\")","v":"H11"}]
[null,{"$f":"IF($C$6=\"By Rows\", \"H5\", \"A12\")","v":"A12"}]
[null,{"$f":"IF($C$6=\"By Rows\", \"H6\", \"B12\")","v":"B12"}]
[null,{"$f":"IF($C$6=\"By Rows\", \"H7\", \"C12\")","v":"C12"}]
[null,{"$f":"IF($C$6=\"By Rows\", \"H8\", \"D12\")","v":"D12"}]
[null,{"$f":"IF($C$6=\"By Rows\", \"H9\", \"E12\")","v":"E12"}]
[null,{"$f":"IF($C$6=\"By Rows\", \"H10\", \"F12\")","v":"F12"}]
[null,{"$f":"IF($C$6=\"By Rows\", \"H11\", \"G12\")","v":"G12"}]
[null,"H12"]

{"sheet":"Plate09","index":10,"n_rows":105,"n_cols":3,"rows_kept":105,"cut":false,"hidden":false,"merged":[[4,1,4,2]]}
[]
[null,"Whole Plasmid Sequencing"]
[null,"Upload form"]
[]
[null,"Plate Information"]
[null,"Sort Plate:","By Columns"]
[]
[]
[null,"Well Position","Sample Name"]
[null,"A1"]
[null,{"$f":"IF($C$6=\"By Rows\", \"A2\", \"B1\")","v":"B1"}]
[null,{"$f":"IF($C$6=\"By Rows\", \"A3\", \"C1\")","v":"C1"}]
[null,{"$f":"IF($C$6=\"By Rows\", \"A4\", \"D1\")","v":"D1"}]
[null,{"$f":"IF($C$6=\"By Rows\", \"A5\", \"E1\")","v":"E1"}]
[null,{"$f":"IF($C$6=\"By Rows\", \"A6\", \"F1\")","v":"F1"}]
[null,{"$f":"IF($C$6=\"By Rows\", \"A7\", \"G1\")","v":"G1"}]
[null,{"$f":"IF($C$6=\"By Rows\", \"A8\", \"H1\")","v":"H1"}]
[null,{"$f":"IF($C$6=\"By Rows\", \"A9\", \"A2\")","v":"A2"}]
[null,{"$f":"IF($C$6=\"By Rows\", \"A10\", \"B2\")","v":"B2"}]
[null,{"$f":"IF($C$6=\"By Rows\", \"A11\", \"C2\")","v":"C2"}]
[null,{"$f":"IF($C$6=\"By Rows\", \"A12\", \"D2\")","v":"D2"}]
[null,{"$f":"IF($C$6=\"By Rows\", \"B1\", \"E2\")","v":"E2"}]
[null,{"$f":"IF($C$6=\"By Rows\", \"B2\", \"F2\")","v":"F2"}]
[null,{"$f":"IF($C$6=\"By Rows\", \"B3\", \"G2\")","v":"G2"}]
[null,{"$f":"IF($C$6=\"By Rows\", \"B4\", \"H2\")","v":"H2"}]
[null,{"$f":"IF($C$6=\"By Rows\", \"B5\", \"A3\")","v":"A3"}]
[null,{"$f":"IF($C$6=\"By Rows\", \"B6\", \"B3\")","v":"B3"}]
[null,{"$f":"IF($C$6=\"By Rows\", \"B7\", \"C3\")","v":"C3"}]
[null,{"$f":"IF($C$6=\"By Rows\", \"B8\", \"D3\")","v":"D3"}]
[null,{"$f":"IF($C$6=\"By Rows\", \"B9\", \"E3\")","v":"E3"}]
[null,{"$f":"IF($C$6=\"By Rows\", \"B10\", \"F3\")","v":"F3"}]
[null,{"$f":"IF($C$6=\"By Rows\", \"B11\", \"G3\")","v":"G3"}]
[null,{"$f":"IF($C$6=\"By Rows\", \"B12\", \"H3\")","v":"H3"}]
[null,{"$f":"IF($C$6=\"By Rows\", \"C1\", \"A4\")","v":"A4"}]
[null,{"$f":"IF($C$6=\"By Rows\", \"C2\", \"B4\")","v":"B4"}]
[null,{"$f":"IF($C$6=\"By Rows\", \"C3\", \"C4\")","v":"C4"}]
[null,{"$f":"IF($C$6=\"By Rows\", \"C4\", \"D4\")","v":"D4"}]
[null,{"$f":"IF($C$6=\"By Rows\", \"C5\", \"E4\")","v":"E4"}]
[null,{"$f":"IF($C$6=\"By Rows\", \"C6\", \"F4\")","v":"F4"}]
[null,{"$f":"IF($C$6=\"By Rows\", \"C7\", \"G4\")","v":"G4"}]
[null,{"$f":"IF($C$6=\"By Rows\", \"C8\", \"H4\")","v":"H4"}]
[null,{"$f":"IF($C$6=\"By Rows\", \"C9\", \"A5\")","v":"A5"}]
[null,{"$f":"IF($C$6=\"By Rows\", \"C10\", \"B5\")","v":"B5"}]
[null,{"$f":"IF($C$6=\"By Rows\", \"C11\", \"C5\")","v":"C5"}]
[null,{"$f":"IF($C$6=\"By Rows\", \"C12\", \"D5\")","v":"D5"}]
[null,{"$f":"IF($C$6=\"By Rows\", \"D1\", \"E5\")","v":"E5"}]
[null,{"$f":"IF($C$6=\"By Rows\", \"D2\", \"F5\")","v":"F5"}]
[null,{"$f":"IF($C$6=\"By Rows\", \"D3\", \"G5\")","v":"G5"}]
[null,{"$f":"IF($C$6=\"By Rows\", \"D4\", \"H5\")","v":"H5"}]
[null,{"$f":"IF($C$6=\"By Rows\", \"D5\", \"A6\")","v":"A6"}]
[null,{"$f":"IF($C$6=\"By Rows\", \"D6\", \"B6\")","v":"B6"}]
[null,{"$f":"IF($C$6=\"By Rows\", \"D7\", \"C6\")","v":"C6"}]
[null,{"$f":"IF($C$6=\"By Rows\", \"D8\", \"D6\")","v":"D6"}]
[null,{"$f":"IF($C$6=\"By Rows\", \"D9\", \"E6\")","v":"E6"}]
[null,{"$f":"IF($C$6=\"By Rows\", \"D10\", \"F6\")","v":"F6"}]
[null,{"$f":"IF($C$6=\"By Rows\", \"D11\", \"G6\")","v":"G6"}]
[null,{"$f":"IF($C$6=\"By Rows\", \"D12\", \"H6\")","v":"H6"}]
[null,{"$f":"IF($C$6=\"By Rows\", \"E1\", \"A7\")","v":"A7"}]
[null,{"$f":"IF($C$6=\"By Rows\", \"E2\", \"B7\")","v":"B7"}]
[null,{"$f":"IF($C$6=\"By Rows\", \"E3\", \"C7\")","v":"C7"}]
[null,{"$f":"IF($C$6=\"By Rows\", \"E4\", \"D7\")","v":"D7"}]
[null,{"$f":"IF($C$6=\"By Rows\", \"E5\", \"E7\")","v":"E7"}]
[null,{"$f":"IF($C$6=\"By Rows\", \"E6\", \"F7\")","v":"F7"}]
[null,{"$f":"IF($C$6=\"By Rows\", \"E7\", \"G7\")","v":"G7"}]
[null,{"$f":"IF($C$6=\"By Rows\", \"E8\", \"H7\")","v":"H7"}]
[null,{"$f":"IF($C$6=\"By Rows\", \"E9\", \"A8\")","v":"A8"}]
[null,{"$f":"IF($C$6=\"By Rows\", \"E10\", \"B8\")","v":"B8"}]
[null,{"$f":"IF($C$6=\"By Rows\", \"E11\", \"C8\")","v":"C8"}]
[null,{"$f":"IF($C$6=\"By Rows\", \"E12\", \"D8\")","v":"D8"}]
[null,{"$f":"IF($C$6=\"By Rows\", \"F1\", \"E8\")","v":"E8"}]
[null,{"$f":"IF($C$6=\"By Rows\", \"F2\", \"F8\")","v":"F8"}]
[null,{"$f":"IF($C$6=\"By Rows\", \"F3\", \"G8\")","v":"G8"}]
[null,{"$f":"IF($C$6=\"By Rows\", \"F4\", \"H8\")","v":"H8"}]
[null,{"$f":"IF($C$6=\"By Rows\", \"F5\", \"A9\")","v":"A9"}]
[null,{"$f":"IF($C$6=\"By Rows\", \"F6\", \"B9\")","v":"B9"}]
[null,{"$f":"IF($C$6=\"By Rows\", \"F7\", \"C9\")","v":"C9"}]
[null,{"$f":"IF($C$6=\"By Rows\", \"F8\", \"D9\")","v":"D9"}]
[null,{"$f":"IF($C$6=\"By Rows\", \"F9\", \"E9\")","v":"E9"}]
[null,{"$f":"IF($C$6=\"By Rows\", \"F10\", \"F9\")","v":"F9"}]
[null,{"$f":"IF($C$6=\"By Rows\", \"F11\", \"G9\")","v":"G9"}]
[null,{"$f":"IF($C$6=\"By Rows\", \"F12\", \"H9\")","v":"H9"}]
[null,{"$f":"IF($C$6=\"By Rows\", \"G1\", \"A10\")","v":"A10"}]
[null,{"$f":"IF($C$6=\"By Rows\", \"G2\", \"B10\")","v":"B10"}]
[null,{"$f":"IF($C$6=\"By Rows\", \"G3\", \"C10\")","v":"C10"}]
[null,{"$f":"IF($C$6=\"By Rows\", \"G4\", \"D10\")","v":"D10"}]
[null,{"$f":"IF($C$6=\"By Rows\", \"G5\", \"E10\")","v":"E10"}]
[null,{"$f":"IF($C$6=\"By Rows\", \"G6\", \"F10\")","v":"F10"}]
[null,{"$f":"IF($C$6=\"By Rows\", \"G7\", \"G10\")","v":"G10"}]
[null,{"$f":"IF($C$6=\"By Rows\", \"G8\", \"H10\")","v":"H10"}]
[null,{"$f":"IF($C$6=\"By Rows\", \"G9\", \"A11\")","v":"A11"}]
[null,{"$f":"IF($C$6=\"By Rows\", \"G10\", \"B11\")","v":"B11"}]
[null,{"$f":"IF($C$6=\"By Rows\", \"G11\", \"C11\")","v":"C11"}]
[null,{"$f":"IF($C$6=\"By Rows\", \"G12\", \"D11\")","v":"D11"}]
[null,{"$f":"IF($C$6=\"By Rows\", \"H1\", \"E11\")","v":"E11"}]
[null,{"$f":"IF($C$6=\"By Rows\", \"H2\", \"F11\")","v":"F11"}]
[null,{"$f":"IF($C$6=\"By Rows\", \"H3\", \"G11\")","v":"G11"}]
[null,{"$f":"IF($C$6=\"By Rows\", \"H4\", \"H11\")","v":"H11"}]
[null,{"$f":"IF($C$6=\"By Rows\", \"H5\", \"A12\")","v":"A12"}]
[null,{"$f":"IF($C$6=\"By Rows\", \"H6\", \"B12\")","v":"B12"}]
[null,{"$f":"IF($C$6=\"By Rows\", \"H7\", \"C12\")","v":"C12"}]
[null,{"$f":"IF($C$6=\"By Rows\", \"H8\", \"D12\")","v":"D12"}]
[null,{"$f":"IF($C$6=\"By Rows\", \"H9\", \"E12\")","v":"E12"}]
[null,{"$f":"IF($C$6=\"By Rows\", \"H10\", \"F12\")","v":"F12"}]
[null,{"$f":"IF($C$6=\"By Rows\", \"H11\", \"G12\")","v":"G12"}]
[null,"H12"]

{"sheet":"Plate10","index":11,"n_rows":105,"n_cols":3,"rows_kept":105,"cut":false,"hidden":false,"merged":[[4,1,4,2]]}
[]
[null,"Whole Plasmid Sequencing"]
[null,"Upload form"]
[]
[null,"Plate Information"]
[null,"Sort Plate:","By Columns"]
[]
[]
[null,"Well Position","Sample Name"]
[null,"A1"]
[null,{"$f":"IF($C$6=\"By Rows\", \"A2\", \"B1\")","v":"B1"}]
[null,{"$f":"IF($C$6=\"By Rows\", \"A3\", \"C1\")","v":"C1"}]
[null,{"$f":"IF($C$6=\"By Rows\", \"A4\", \"D1\")","v":"D1"}]
[null,{"$f":"IF($C$6=\"By Rows\", \"A5\", \"E1\")","v":"E1"}]
[null,{"$f":"IF($C$6=\"By Rows\", \"A6\", \"F1\")","v":"F1"}]
[null,{"$f":"IF($C$6=\"By Rows\", \"A7\", \"G1\")","v":"G1"}]
[null,{"$f":"IF($C$6=\"By Rows\", \"A8\", \"H1\")","v":"H1"}]
[null,{"$f":"IF($C$6=\"By Rows\", \"A9\", \"A2\")","v":"A2"}]
[null,{"$f":"IF($C$6=\"By Rows\", \"A10\", \"B2\")","v":"B2"}]
[null,{"$f":"IF($C$6=\"By Rows\", \"A11\", \"C2\")","v":"C2"}]
[null,{"$f":"IF($C$6=\"By Rows\", \"A12\", \"D2\")","v":"D2"}]
[null,{"$f":"IF($C$6=\"By Rows\", \"B1\", \"E2\")","v":"E2"}]
[null,{"$f":"IF($C$6=\"By Rows\", \"B2\", \"F2\")","v":"F2"}]
[null,{"$f":"IF($C$6=\"By Rows\", \"B3\", \"G2\")","v":"G2"}]
[null,{"$f":"IF($C$6=\"By Rows\", \"B4\", \"H2\")","v":"H2"}]
[null,{"$f":"IF($C$6=\"By Rows\", \"B5\", \"A3\")","v":"A3"}]
[null,{"$f":"IF($C$6=\"By Rows\", \"B6\", \"B3\")","v":"B3"}]
[null,{"$f":"IF($C$6=\"By Rows\", \"B7\", \"C3\")","v":"C3"}]
[null,{"$f":"IF($C$6=\"By Rows\", \"B8\", \"D3\")","v":"D3"}]
[null,{"$f":"IF($C$6=\"By Rows\", \"B9\", \"E3\")","v":"E3"}]
[null,{"$f":"IF($C$6=\"By Rows\", \"B10\", \"F3\")","v":"F3"}]
[null,{"$f":"IF($C$6=\"By Rows\", \"B11\", \"G3\")","v":"G3"}]
[null,{"$f":"IF($C$6=\"By Rows\", \"B12\", \"H3\")","v":"H3"}]
[null,{"$f":"IF($C$6=\"By Rows\", \"C1\", \"A4\")","v":"A4"}]
[null,{"$f":"IF($C$6=\"By Rows\", \"C2\", \"B4\")","v":"B4"}]
[null,{"$f":"IF($C$6=\"By Rows\", \"C3\", \"C4\")","v":"C4"}]
[null,{"$f":"IF($C$6=\"By Rows\", \"C4\", \"D4\")","v":"D4"}]
[null,{"$f":"IF($C$6=\"By Rows\", \"C5\", \"E4\")","v":"E4"}]
[null,{"$f":"IF($C$6=\"By Rows\", \"C6\", \"F4\")","v":"F4"}]
[null,{"$f":"IF($C$6=\"By Rows\", \"C7\", \"G4\")","v":"G4"}]
[null,{"$f":"IF($C$6=\"By Rows\", \"C8\", \"H4\")","v":"H4"}]
[null,{"$f":"IF($C$6=\"By Rows\", \"C9\", \"A5\")","v":"A5"}]
[null,{"$f":"IF($C$6=\"By Rows\", \"C10\", \"B5\")","v":"B5"}]
[null,{"$f":"IF($C$6=\"By Rows\", \"C11\", \"C5\")","v":"C5"}]
[null,{"$f":"IF($C$6=\"By Rows\", \"C12\", \"D5\")","v":"D5"}]
[null,{"$f":"IF($C$6=\"By Rows\", \"D1\", \"E5\")","v":"E5"}]
[null,{"$f":"IF($C$6=\"By Rows\", \"D2\", \"F5\")","v":"F5"}]
[null,{"$f":"IF($C$6=\"By Rows\", \"D3\", \"G5\")","v":"G5"}]
[null,{"$f":"IF($C$6=\"By Rows\", \"D4\", \"H5\")","v":"H5"}]
[null,{"$f":"IF($C$6=\"By Rows\", \"D5\", \"A6\")","v":"A6"}]
[null,{"$f":"IF($C$6=\"By Rows\", \"D6\", \"B6\")","v":"B6"}]
[null,{"$f":"IF($C$6=\"By Rows\", \"D7\", \"C6\")","v":"C6"}]
[null,{"$f":"IF($C$6=\"By Rows\", \"D8\", \"D6\")","v":"D6"}]
[null,{"$f":"IF($C$6=\"By Rows\", \"D9\", \"E6\")","v":"E6"}]
[null,{"$f":"IF($C$6=\"By Rows\", \"D10\", \"F6\")","v":"F6"}]
[null,{"$f":"IF($C$6=\"By Rows\", \"D11\", \"G6\")","v":"G6"}]
[null,{"$f":"IF($C$6=\"By Rows\", \"D12\", \"H6\")","v":"H6"}]
[null,{"$f":"IF($C$6=\"By Rows\", \"E1\", \"A7\")","v":"A7"}]
[null,{"$f":"IF($C$6=\"By Rows\", \"E2\", \"B7\")","v":"B7"}]
[null,{"$f":"IF($C$6=\"By Rows\", \"E3\", \"C7\")","v":"C7"}]
[null,{"$f":"IF($C$6=\"By Rows\", \"E4\", \"D7\")","v":"D7"}]
[null,{"$f":"IF($C$6=\"By Rows\", \"E5\", \"E7\")","v":"E7"}]
[null,{"$f":"IF($C$6=\"By Rows\", \"E6\", \"F7\")","v":"F7"}]
[null,{"$f":"IF($C$6=\"By Rows\", \"E7\", \"G7\")","v":"G7"}]
[null,{"$f":"IF($C$6=\"By Rows\", \"E8\", \"H7\")","v":"H7"}]
[null,{"$f":"IF($C$6=\"By Rows\", \"E9\", \"A8\")","v":"A8"}]
[null,{"$f":"IF($C$6=\"By Rows\", \"E10\", \"B8\")","v":"B8"}]
[null,{"$f":"IF($C$6=\"By Rows\", \"E11\", \"C8\")","v":"C8"}]
[null,{"$f":"IF($C$6=\"By Rows\", \"E12\", \"D8\")","v":"D8"}]
[null,{"$f":"IF($C$6=\"By Rows\", \"F1\", \"E8\")","v":"E8"}]
[null,{"$f":"IF($C$6=\"By Rows\", \"F2\", \"F8\")","v":"F8"}]
[null,{"$f":"IF($C$6=\"By Rows\", \"F3\", \"G8\")","v":"G8"}]
[null,{"$f":"IF($C$6=\"By Rows\", \"F4\", \"H8\")","v":"H8"}]
[null,{"$f":"IF($C$6=\"By Rows\", \"F5\", \"A9\")","v":"A9"}]
[null,{"$f":"IF($C$6=\"By Rows\", \"F6\", \"B9\")","v":"B9"}]
[null,{"$f":"IF($C$6=\"By Rows\", \"F7\", \"C9\")","v":"C9"}]
[null,{"$f":"IF($C$6=\"By Rows\", \"F8\", \"D9\")","v":"D9"}]
[null,{"$f":"IF($C$6=\"By Rows\", \"F9\", \"E9\")","v":"E9"}]
[null,{"$f":"IF($C$6=\"By Rows\", \"F10\", \"F9\")","v":"F9"}]
[null,{"$f":"IF($C$6=\"By Rows\", \"F11\", \"G9\")","v":"G9"}]
[null,{"$f":"IF($C$6=\"By Rows\", \"F12\", \"H9\")","v":"H9"}]
[null,{"$f":"IF($C$6=\"By Rows\", \"G1\", \"A10\")","v":"A10"}]
[null,{"$f":"IF($C$6=\"By Rows\", \"G2\", \"B10\")","v":"B10"}]
[null,{"$f":"IF($C$6=\"By Rows\", \"G3\", \"C10\")","v":"C10"}]
[null,{"$f":"IF($C$6=\"By Rows\", \"G4\", \"D10\")","v":"D10"}]
[null,{"$f":"IF($C$6=\"By Rows\", \"G5\", \"E10\")","v":"E10"}]
[null,{"$f":"IF($C$6=\"By Rows\", \"G6\", \"F10\")","v":"F10"}]
[null,{"$f":"IF($C$6=\"By Rows\", \"G7\", \"G10\")","v":"G10"}]
[null,{"$f":"IF($C$6=\"By Rows\", \"G8\", \"H10\")","v":"H10"}]
[null,{"$f":"IF($C$6=\"By Rows\", \"G9\", \"A11\")","v":"A11"}]
[null,{"$f":"IF($C$6=\"By Rows\", \"G10\", \"B11\")","v":"B11"}]
[null,{"$f":"IF($C$6=\"By Rows\", \"G11\", \"C11\")","v":"C11"}]
[null,{"$f":"IF($C$6=\"By Rows\", \"G12\", \"D11\")","v":"D11"}]
[null,{"$f":"IF($C$6=\"By Rows\", \"H1\", \"E11\")","v":"E11"}]
[null,{"$f":"IF($C$6=\"By Rows\", \"H2\", \"F11\")","v":"F11"}]
[null,{"$f":"IF($C$6=\"By Rows\", \"H3\", \"G11\")","v":"G11"}]
[null,{"$f":"IF($C$6=\"By Rows\", \"H4\", \"H11\")","v":"H11"}]
[null,{"$f":"IF($C$6=\"By Rows\", \"H5\", \"A12\")","v":"A12"}]
[null,{"$f":"IF($C$6=\"By Rows\", \"H6\", \"B12\")","v":"B12"}]
[null,{"$f":"IF($C$6=\"By Rows\", \"H7\", \"C12\")","v":"C12"}]
[null,{"$f":"IF($C$6=\"By Rows\", \"H8\", \"D12\")","v":"D12"}]
[null,{"$f":"IF($C$6=\"By Rows\", \"H9\", \"E12\")","v":"E12"}]
[null,{"$f":"IF($C$6=\"By Rows\", \"H10\", \"F12\")","v":"F12"}]
[null,{"$f":"IF($C$6=\"By Rows\", \"H11\", \"G12\")","v":"G12"}]
[null,"H12"]