{"text_format":"2","workbook":"xlsx","n_sheets":18,"sheets":["_Version 1","_DropData","_Helpful Tips","Plate01","Plate02","Plate03","Plate04","Plate05","Plate06","Plate07","Plate08","Plate09","Plate10","Plate11","Plate12","Plate13","Plate14","Plate15"],"not_rendered":{"charts":0,"images":2,"macros":0,"external_links":0,"defined_names":32,"comments":0,"pivot_tables":0},"unopened":[],"bounds":{"document_bytes":16777216,"sheet_cells":100000,"run_cost":"one","rows_first":2000,"rows_last":500,"rows_between":2000,"halvings":0,"cell_chars":16384,"cell_head_chars":4096},"cells_cut":0,"cells_raw":0,"read":"whole","date_system":"1900"}

{"sheet":"_Version 1","index":0,"n_rows":2,"n_cols":2,"rows_kept":2,"cut":false,"hidden":true,"merged":[]}
["Version 2"]
["2014-04-01","Converted form from previous upload template to xlsx format"]

{"sheet":"_DropData","index":1,"n_rows":143,"n_cols":6,"rows_kept":143,"cut":false,"hidden":true,"merged":[]}
["Yes"]
["No",null,"3AOX","Yes",null,"Please select"]
[null,null,"5AOX","Yes",null,"Plasmid"]
["PCR",null,"96gIII","Yes",null,"PCR Products"]
["Plasmid",null,"BGHrev","Yes",null,"Mix of Both"]
["BAC",null,"CMVf","Yes"]
["Standard",null,"EGFPC1F","Yes"]
["Power Read",null,"EGFPC1R","Yes",null,"Plasmids"]
[null,null,"EGFPN1F","Yes",null,"PCR Products"]
[null,null,"EGFPN1R","Yes",null,"Mix of Both"]
["Free Standard",null,"GadFor","Yes"]
["Needs Synthesis",null,"GadRev","Yes"]
["Enclosed",null,"Gal4AD","Yes"]
["Stored",null,"Gal4BD","Yes"]
["Premixed",null,"GL2","Yes"]
[null,null,"M1396","Yes"]
[null,null,"M13F","Yes"]
["Standard",null,"M13F43","Yes"]
["GC or GT Rich",null,"M13R","Yes"]
["2° Structure",null,"M13R49","Yes"]
["shRNA construct",null,"malE","Yes"]
["Repeats",null,"pBabeF","Yes"]
["Other",null,"pBabeR","Yes"]
[null,null,"pBadF","Yes"]
["N/A",null,"pBadR","Yes"]
[null,null,"pcDNAF","Yes"]
["By Columns",null,"pcDNAR","Yes"]
["By Rows",null,"petup","Yes"]
[null,null,"pFBACf","Yes"]
["PCR",null,"pFBACr","Yes"]
["Plasmid",null,"pGexF","Yes"]
["BAC",null,"pGexR","Yes"]
["Standard",null,"pGL3for","Yes"]
["Power Read",null,"pGLfor","Yes"]
["Premixed",null,"pGLrev","Yes"]
["Stored",null,"pJET12F","Yes"]
["Enclosed",null,"pJET12R","Yes"]
[null,null,"pJET1F","Yes"]
[null,null,"pJET1R","Yes"]
[null,null,"pQEfPR","Yes"]
[null,null,"pQErev","Yes"]
[null,null,"pShCMVf","Yes"]
["Primer",null,"pShCMVr","Yes"]
[null,null,"RV3","Yes"]
["Standard",null,"SP6","Yes"]
["Enclosed",null,"T3","Yes"]
["Stored",null,"T7","Yes"]
["Custom Synthesis",null,"T7PCS2","Yes"]
[null,null,"T7term","Yes"]
[null,null,"TrcHisF","Yes"]
["Template Size",null,"TrcHisR","Yes"]
[null,null,"V5","Yes"]
["Less than 200bp",null,null,"Yes"]
["201 - 500bp",null,null,"Yes"]
["1Kb - 2Kb",null,null,"Yes"]
["2Kb-6Kb",null,null,"Yes"]
["10Kb - 19Kb",null,null,"Yes"]
[">20Kb"]
[]
[]
[]
[]
["Standard"]
["Enclosed"]
["Stored"]
["Custom Synthesis"]
[]
[]
["TemplateType done"]
[]
["Purified PCR"]
["Unpurified PCR "]
["Plasmid"]
["Glycerol Stock"]
["Bacterial Colony"]
["Pelleted Cells"]
["Streak Plate"]
["BAC "]
["Stored at Eurofins"]
[]
["Reaction Chemistry"]
[]
["Standard, DNA Read"]
["Difficult, Power Read"]
[" >20Kb, Large Clone Read"]
[]
["PCRProducts"]
[]
["0.10-0.29 kbp"]
["0.30-0.99 kbp"]
["1.00-5.99 kbp"]
["6.00-19.99 kbp"]
[">20.00 kbp"]
["Unknown"]
[]
[null,null,"0.10-0.29 kbp"]
[null,null,"0.30-0.99 kbp"]
[null,null,"1.00-5.99 kbp"]
["Plasmids",null,"6.00-19.99 kbp"]
[null,null,">20.00 kbp"]
["0.10-0.29 kbp",null,"Unknown"]
["0.30-0.99 kbp"]
["1.00-5.99 kbp"]
["6.00-19.99 kbp"]
[">20.00 kbp"]
["Unknown"]
[]
["MixofBoth"]
[]
["0.10-0.29 kbp"]
["0.30-0.99 kbp"]
["1.00-5.99 kbp"]
["6.00-19.99 kbp"]
[">20.00 kbp"]
["Unknown"]
[]
["Power Reads?","Plate 1","Plate 2","Plate 3","Plate 4","Plate 5"]
[null,{"$f":"COUNTA(Plate01!$C$13:$C$106)","v":1},{"$f":"COUNTA(#REF!)","v":1},{"$f":"COUNTA(#REF!)","v":1},{"$f":"COUNTA(#REF!)","v":1},{"$f":"COUNTA(#REF!)","v":1}]
["Yes"]
["No","Plate 6","Plate 7","Plate 8","Plate 9","Plate 10"]
[null,{"$f":"COUNTA(#REF!)","v":1},{"$f":"COUNTA(#REF!)","v":1},{"$f":"COUNTA(#REF!)","v":1},{"$f":"COUNTA(#REF!)","v":1},{"$f":"COUNTA(#REF!)","v":1}]
[]
[null,"Plate 11","Plate 12","Plate 13","Plate 14","Plate 15"]
["# of samples",{"$f":"COUNTA(#REF!)","v":1},{"$f":"COUNTA(#REF!)","v":1},{"$f":"COUNTA(#REF!)","v":1},{"$f":"COUNTA(#REF!)","v":1},{"$f":"COUNTA(#REF!)","v":1}]
[]
[null,"Plate 16","Plate 17","Plate 18","Plate 19","Plate 20"]
[null,{"$f":"COUNTA(#REF!)","v":1},{"$f":"COUNTA(#REF!)","v":1},{"$f":"COUNTA(#REF!)","v":1},{"$f":"COUNTA(#REF!)","v":1},{"$f":"COUNTA(#REF!)","v":1}]
[]
[]
[]
[]
[]
[null,"Plate 1","Plate 2","Plate 3","Plate 4","Plate 5"]
[null,{"$f":"COUNTA(Plate01!#REF!,Plate01!#REF!,Plate01!#REF!,Plate01!#REF!)","v":4},{"$f":"COUNTA(#REF!,#REF!,#REF!,#REF!)","v":4},{"$f":"COUNTA(#REF!,#REF!,#REF!,#REF!)","v":4},{"$f":"COUNTA(#REF!,#REF!,#REF!,#REF!)","v":4},{"$f":"COUNTA(#REF!,#REF!,#REF!,#REF!)","v":4}]
[]
[null,"Plate 6","Plate 7","Plate 8","Plate 9","Plate 10"]
[null,{"$f":"COUNTA(#REF!,#REF!,#REF!,#REF!)","v":4},{"$f":"COUNTA(#REF!,#REF!,#REF!,#REF!)","v":4},{"$f":"COUNTA(#REF!,#REF!,#REF!,#REF!)","v":4},{"$f":"COUNTA(#REF!,#REF!,#REF!,#REF!)","v":4},{"$f":"COUNTA(#REF!,#REF!,#REF!,#REF!)","v":4}]
[]
[null,"Plate 11","Plate 12","Plate 13","Plate 14","Plate 15"]
["# of reactions",{"$f":"COUNTA(#REF!,#REF!,#REF!,#REF!)","v":4},{"$f":"COUNTA(#REF!,#REF!,#REF!,#REF!)","v":4},{"$f":"COUNTA(#REF!,#REF!,#REF!,#REF!)","v":4},{"$f":"COUNTA(#REF!,#REF!,#REF!,#REF!)","v":4},{"$f":"COUNTA(#REF!,#REF!,#REF!,#REF!)","v":4}]
[]
[null,"Plate 16","Plate 17","Plate 18","Plate 19","Plate 20"]
[null,{"$f":"COUNTA(#REF!,#REF!,#REF!,#REF!)","v":4},{"$f":"COUNTA(#REF!,#REF!,#REF!,#REF!)","v":4},{"$f":"COUNTA(#REF!,#REF!,#REF!,#REF!)","v":4},{"$f":"COUNTA(#REF!,#REF!,#REF!,#REF!)","v":4},{"$f":"COUNTA(#REF!,#REF!,#REF!,#REF!)","v":4}]

{"sheet":"_Helpful Tips","index":2,"n_rows":38,"n_cols":6,"rows_kept":38,"cut":false,"hidden":false,"merged":[[10,3,10,13],[37,3,38,12],[36,3,36,12],[18,3,20,12],[22,3,24,12],[29,3,31,12],[34,3,34,7],[26,3,26,12]]}
[]
[]
[]
[]
[]
[{"$nulls":4},"Trouble Uploading the Template?"]
[]
[{"$nulls":4},"Phone Support:  ","1-800-688-2248 "]
[{"$nulls":4},"Email Support:  ","GenomicsSupport@eurofins.com"]
[]
[null,null,null,"The ShortSeq plate sequencing service is the sequencing service with the shortest turnaround time. To avail the ShortSeq service, you must\n1) require only Standard Read condition for the samples\n2) premix the primers with the samples."]
[]
[]
[]
[]
[]
[null,null,null,"Common Hiccups "]
[]
[null,null,1,"Invalid Characters: It is easy to accidentally insert invalid characters into the primer name or DNA name fields.  Acceptable characters include any letters (A-Z), numbers (0-9), and an underscore or dash."]
[]
[]
[]
[null,null,2,"Empty Wells: To leave a well empty, simply leave the cell(s) blank. Do not delete the well position. "]
[]
[]
[]
[null,null,3,"Plate Name: To name your plate, change the corresponding worksheet's name. "]
[]
[]
[null,null,4,"Plate Order: Each worksheet in this template should correspond to each plate of DNA you will ship to Eurofins Genomics."]
[]
[]
[]
[null,null,5,"Sample Submission Guidelines: To achieve the best results follow the guidelines in the link described below. "]
[null,null,null,"Click here to go to the Sample Submission Guidelines"]
[]
[]
[null,null,6,"Premixed Samples: All the samples submitted in the 96-well plate for the ShortSeq service must be sent after mixing the primer with the sample."]

{"sheet":"Plate01","index":3,"n_rows":108,"n_cols":9,"rows_kept":108,"cut":false,"hidden":false,"merged":[[4,1,4,2]]}
[]
[null,"ShortSeq Plate (formerly Express Plate)"]
[null,"Upload Form"]
[]
[null,"Plate Information"]
[null,"Plate Barcode:",null,null,null,"Mandatory"]
[null,"Sample Type:",null,null,null,"Optional"]
[null,{"$f":"IF(C7=\"PCR Products\", \"Product Length:\", \"Construct Size:\")","v":"Construct Size:"}]
[null,"Sort Plate:","By Columns"]
[]
[]
[null,"Well Position","Sample Name                              "]
[null,"A1","Example"]
[null,{"$f":"IF($C$9=\"By Rows\",\"A2\",\"B1\")","v":"B1"}]
[null,{"$f":"IF($C$9=\"By Rows\",\"A3\",\"C1\")","v":"C1"}]
[null,{"$f":"IF($C$9=\"By Rows\",\"A4\",\"D1\")","v":"D1"}]
[null,{"$f":"IF($C$9=\"By Rows\",\"A5\",\"E1\")","v":"E1"}]
[null,{"$f":"IF($C$9=\"By Rows\",\"A6\",\"F1\")","v":"F1"}]
[null,{"$f":"IF($C$9=\"By Rows\",\"A7\",\"G1\")","v":"G1"}]
[null,{"$f":"IF($C$9=\"By Rows\",\"A8\",\"H1\")","v":"H1"}]
[null,{"$f":"IF($C$9=\"By Rows\",\"A9\",\"A2\")","v":"A2"}]
[null,{"$f":"IF($C$9=\"By Rows\",\"A10\",\"B2\")","v":"B2"}]
[null,{"$f":"IF($C$9=\"By Rows\",\"A11\",\"C2\")","v":"C2"}]
[null,{"$f":"IF($C$9=\"By Rows\",\"A12\",\"D2\")","v":"D2"}]
[null,{"$f":"IF($C$9=\"By Rows\",\"B1\",\"E2\")","v":"E2"}]
[null,{"$f":"IF($C$9=\"By Rows\",\"B2\",\"F2\")","v":"F2"}]
[null,{"$f":"IF($C$9=\"By Rows\",\"B3\",\"G2\")","v":"G2"}]
[null,{"$f":"IF($C$9=\"By Rows\",\"B4\",\"H2\")","v":"H2"}]
[null,{"$f":"IF($C$9=\"By Rows\",\"B5\",\"A3\")","v":"A3"}]
[null,{"$f":"IF($C$9=\"By Rows\",\"B6\",\"B3\")","v":"B3"}]
[null,{"$f":"IF($C$9=\"By Rows\",\"B7\",\"C3\")","v":"C3"}]
[null,{"$f":"IF($C$9=\"By Rows\",\"B8\",\"D3\")","v":"D3"}]
[null,{"$f":"IF($C$9=\"By Rows\",\"B9\",\"E3\")","v":"E3"}]
[null,{"$f":"IF($C$9=\"By Rows\",\"B10\",\"F3\")","v":"F3"}]
[null,{"$f":"IF($C$9=\"By Rows\",\"B11\",\"G3\")","v":"G3"}]
[null,{"$f":"IF($C$9=\"By Rows\",\"B12\",\"H3\")","v":"H3"}]
[null,{"$f":"IF($C$9=\"By Rows\",\"C1\",\"A4\")","v":"A4"}]
[null,{"$f":"IF($C$9=\"By Rows\",\"C2\",\"B4\")","v":"B4"}]
[null,{"$f":"IF($C$9=\"By Rows\",\"C3\",\"C4\")","v":"C4"}]
[null,{"$f":"IF($C$9=\"By Rows\",\"C4\",\"D4\")","v":"D4"}]
[null,{"$f":"IF($C$9=\"By Rows\",\"C5\",\"E4\")","v":"E4"}]
[null,{"$f":"IF($C$9=\"By Rows\",\"C6\",\"F4\")","v":"F4"}]
[null,{"$f":"IF($C$9=\"By Rows\",\"C7\",\"G4\")","v":"G4"}]
[null,{"$f":"IF($C$9=\"By Rows\",\"C8\",\"H4\")","v":"H4"}]
[null,{"$f":"IF($C$9=\"By Rows\",\"C9\",\"A5\")","v":"A5"}]
[null,{"$f":"IF($C$9=\"By Rows\",\"C10\",\"B5\")","v":"B5"}]
[null,{"$f":"IF($C$9=\"By Rows\",\"C11\",\"C5\")","v":"C5"}]
[null,{"$f":"IF($C$9=\"By Rows\",\"C12\",\"D5\")","v":"D5"}]
[null,{"$f":"IF($C$9=\"By Rows\",\"D1\",\"E5\")","v":"E5"}]
[null,{"$f":"IF($C$9=\"By Rows\",\"D2\",\"F5\")","v":"F5"}]
[null,{"$f":"IF($C$9=\"By Rows\",\"D3\",\"G5\")","v":"G5"}]
[null,{"$f":"IF($C$9=\"By Rows\",\"D4\",\"H5\")","v":"H5"}]
[null,{"$f":"IF($C$9=\"By Rows\",\"D5\",\"A6\")","v":"A6"}]
[null,{"$f":"IF($C$9=\"By Rows\",\"D6\",\"B6\")","v":"B6"}]
[null,{"$f":"IF($C$9=\"By Rows\",\"D7\",\"C6\")","v":"C6"}]
[null,{"$f":"IF($C$9=\"By Rows\",\"D8\",\"D6\")","v":"D6"}]
[null,{"$f":"IF($C$9=\"By Rows\",\"D9\",\"E6\")","v":"E6"}]
[null,{"$f":"IF($C$9=\"By Rows\",\"D10\",\"F6\")","v":"F6"}]
[null,{"$f":"IF($C$9=\"By Rows\",\"D11\",\"G6\")","v":"G6"}]
[null,{"$f":"IF($C$9=\"By Rows\",\"D12\",\"H6\")","v":"H6"}]
[null,{"$f":"IF($C$9=\"By Rows\",\"E1\",\"A7\")","v":"A7"}]
[null,{"$f":"IF($C$9=\"By Rows\",\"E2\",\"B7\")","v":"B7"}]
[null,{"$f":"IF($C$9=\"By Rows\",\"E3\",\"C7\")","v":"C7"}]
[null,{"$f":"IF($C$9=\"By Rows\",\"E4\",\"D7\")","v":"D7"}]
[null,{"$f":"IF($C$9=\"By Rows\",\"E5\",\"E7\")","v":"E7"}]
[null,{"$f":"IF($C$9=\"By Rows\",\"E6\",\"F7\")","v":"F7"}]
[null,{"$f":"IF($C$9=\"By Rows\",\"E7\",\"G7\")","v":"G7"}]
[null,{"$f":"IF($C$9=\"By Rows\",\"E8\",\"H7\")","v":"H7"}]
[null,{"$f":"IF($C$9=\"By Rows\",\"E9\",\"A8\")","v":"A8"}]
[null,{"$f":"IF($C$9=\"By Rows\",\"E10\",\"B8\")","v":"B8"}]
[null,{"$f":"IF($C$9=\"By Rows\",\"E11\",\"C8\")","v":"C8"}]
[null,{"$f":"IF($C$9=\"By Rows\",\"E12\",\"D8\")","v":"D8"}]
[null,{"$f":"IF($C$9=\"By Rows\",\"F1\",\"E8\")","v":"E8"}]
[null,{"$f":"IF($C$9=\"By Rows\",\"F2\",\"F8\")","v":"F8"}]
[null,{"$f":"IF($C$9=\"By Rows\",\"F3\",\"G8\")","v":"G8"}]
[null,{"$f":"IF($C$9=\"By Rows\",\"F4\",\"H8\")","v":"H8"}]
[null,{"$f":"IF($C$9=\"By Rows\",\"F5\",\"A9\")","v":"A9"}]
[null,{"$f":"IF($C$9=\"By Rows\",\"F6\",\"B9\")","v":"B9"}]
[null,{"$f":"IF($C$9=\"By Rows\",\"F7\",\"C9\")","v":"C9"}]
[null,{"$f":"IF($C$9=\"By Rows\",\"F8\",\"D9\")","v":"D9"}]
[null,{"$f":"IF($C$9=\"By Rows\",\"F9\",\"E9\")","v":"E9"}]
[null,{"$f":"IF($C$9=\"By Rows\",\"F10\",\"F9\")","v":"F9"}]
[null,{"$f":"IF($C$9=\"By Rows\",\"F11\",\"G9\")","v":"G9"}]
[null,{"$f":"IF($C$9=\"By Rows\",\"F12\",\"H9\")","v":"H9"}]
[null,{"$f":"IF($C$9=\"By Rows\",\"G1\",\"A10\")","v":"A10"}]
[null,{"$f":"IF($C$9=\"By Rows\",\"G2\",\"B10\")","v":"B10"}]
[null,{"$f":"IF($C$9=\"By Rows\",\"G3\",\"C10\")","v":"C10"}]
[null,{"$f":"IF($C$9=\"By Rows\",\"G4\",\"D10\")","v":"D10"}]
[null,{"$f":"IF($C$9=\"By Rows\",\"G5\",\"E10\")","v":"E10"}]
[null,{"$f":"IF($C$9=\"By Rows\",\"G6\",\"F10\")","v":"F10"}]
[null,{"$f":"IF($C$9=\"By Rows\",\"G7\",\"G10\")","v":"G10"}]
[null,{"$f":"IF($C$9=\"By Rows\",\"G8\",\"H10\")","v":"H10"}]
[null,{"$f":"IF($C$9=\"By Rows\",\"G9\",\"A11\")","v":"A11"}]
[null,{"$f":"IF($C$9=\"By Rows\",\"G10\",\"B11\")","v":"B11"}]
[null,{"$f":"IF($C$9=\"By Rows\",\"G11\",\"C11\")","v":"C11"}]
[null,{"$f":"IF($C$9=\"By Rows\",\"G12\",\"D11\")","v":"D11"}]
[null,{"$f":"IF($C$9=\"By Rows\",\"H1\",\"E11\")","v":"E11"}]
[null,{"$f":"IF($C$9=\"By Rows\",\"H2\",\"F11\")","v":"F11"}]
[null,{"$f":"IF($C$9=\"By Rows\",\"H3\",\"G11\")","v":"G11"}]
[null,{"$f":"IF($C$9=\"By Rows\",\"H4\",\"H11\")","v":"H11"}]
[null,{"$f":"IF($C$9=\"By Rows\",\"H5\",\"A12\")","v":"A12"},{"$nulls":6}," "]
[null,{"$f":"IF($C$9=\"By Rows\",\"H6\",\"B12\")","v":"B12"}]
[null,{"$f":"IF($C$9=\"By Rows\",\"H7\",\"C12\")","v":"C12"}]
[null,{"$f":"IF($C$9=\"By Rows\",\"H8\",\"D12\")","v":"D12"}]
[null,{"$f":"IF($C$9=\"By Rows\",\"H9\",\"E12\")","v":"E12"}]
[null,{"$f":"IF($C$9=\"By Rows\",\"H10\",\"F12\")","v":"F12"}]
[null,{"$f":"IF($C$9=\"By Rows\",\"H11\",\"G12\")","v":"G12"}]
[null,"H12"]

{"sheet":"Plate02","index":4,"n_rows":108,"n_cols":9,"rows_kept":108,"cut":false,"hidden":false,"merged":[[4,1,4,2]]}
[]
[null,"ShortSeq Plate (formerly Express Plate)"]
[null,"Upload Form"]
[]
[null,"Plate Information"]
[null,"Plate Barcode:",null,null,null,"Mandatory"]
[null,"Sample Type:",null,null,null,"Optional"]
[null,{"$f":"IF(C7=\"PCR Products\", \"Product Length:\", \"Construct Size:\")","v":"Construct Size:"}]
[null,"Sort Plate:","By Columns"]
[]
[]
[null,"Well Position","Sample Name                              "]
[null,"A1"]
[null,{"$f":"IF($C$9=\"By Rows\",\"A2\",\"B1\")","v":"B1"}]
[null,{"$f":"IF($C$9=\"By Rows\",\"A3\",\"C1\")","v":"C1"}]
[null,{"$f":"IF($C$9=\"By Rows\",\"A4\",\"D1\")","v":"D1"}]
[null,{"$f":"IF($C$9=\"By Rows\",\"A5\",\"E1\")","v":"E1"}]
[null,{"$f":"IF($C$9=\"By Rows\",\"A6\",\"F1\")","v":"F1"}]
[null,{"$f":"IF($C$9=\"By Rows\",\"A7\",\"G1\")","v":"G1"}]
[null,{"$f":"IF($C$9=\"By Rows\",\"A8\",\"H1\")","v":"H1"}]
[null,{"$f":"IF($C$9=\"By Rows\",\"A9\",\"A2\")","v":"A2"}]
[null,{"$f":"IF($C$9=\"By Rows\",\"A10\",\"B2\")","v":"B2"}]
[null,{"$f":"IF($C$9=\"By Rows\",\"A11\",\"C2\")","v":"C2"}]
[null,{"$f":"IF($C$9=\"By Rows\",\"A12\",\"D2\")","v":"D2"}]
[null,{"$f":"IF($C$9=\"By Rows\",\"B1\",\"E2\")","v":"E2"}]
[null,{"$f":"IF($C$9=\"By Rows\",\"B2\",\"F2\")","v":"F2"}]
[null,{"$f":"IF($C$9=\"By Rows\",\"B3\",\"G2\")","v":"G2"}]
[null,{"$f":"IF($C$9=\"By Rows\",\"B4\",\"H2\")","v":"H2"}]
[null,{"$f":"IF($C$9=\"By Rows\",\"B5\",\"A3\")","v":"A3"}]
[null,{"$f":"IF($C$9=\"By Rows\",\"B6\",\"B3\")","v":"B3"}]
[null,{"$f":"IF($C$9=\"By Rows\",\"B7\",\"C3\")","v":"C3"}]
[null,{"$f":"IF($C$9=\"By Rows\",\"B8\",\"D3\")","v":"D3"}]
[null,{"$f":"IF($C$9=\"By Rows\",\"B9\",\"E3\")","v":"E3"}]
[null,{"$f":"IF($C$9=\"By Rows\",\"B10\",\"F3\")","v":"F3"}]
[null,{"$f":"IF($C$9=\"By Rows\",\"B11\",\"G3\")","v":"G3"}]
[null,{"$f":"IF($C$9=\"By Rows\",\"B12\",\"H3\")","v":"H3"}]
[null,{"$f":"IF($C$9=\"By Rows\",\"C1\",\"A4\")","v":"A4"}]
[null,{"$f":"IF($C$9=\"By Rows\",\"C2\",\"B4\")","v":"B4"}]
[null,{"$f":"IF($C$9=\"By Rows\",\"C3\",\"C4\")","v":"C4"}]
[null,{"$f":"IF($C$9=\"By Rows\",\"C4\",\"D4\")","v":"D4"}]
[null,{"$f":"IF($C$9=\"By Rows\",\"C5\",\"E4\")","v":"E4"}]
[null,{"$f":"IF($C$9=\"By Rows\",\"C6\",\"F4\")","v":"F4"}]
[null,{"$f":"IF($C$9=\"By Rows\",\"C7\",\"G4\")","v":"G4"}]
[null,{"$f":"IF($C$9=\"By Rows\",\"C8\",\"H4\")","v":"H4"}]
[null,{"$f":"IF($C$9=\"By Rows\",\"C9\",\"A5\")","v":"A5"}]
[null,{"$f":"IF($C$9=\"By Rows\",\"C10\",\"B5\")","v":"B5"}]
[null,{"$f":"IF($C$9=\"By Rows\",\"C11\",\"C5\")","v":"C5"}]
[null,{"$f":"IF($C$9=\"By Rows\",\"C12\",\"D5\")","v":"D5"}]
[null,{"$f":"IF($C$9=\"By Rows\",\"D1\",\"E5\")","v":"E5"}]
[null,{"$f":"IF($C$9=\"By Rows\",\"D2\",\"F5\")","v":"F5"}]
[null,{"$f":"IF($C$9=\"By Rows\",\"D3\",\"G5\")","v":"G5"}]
[null,{"$f":"IF($C$9=\"By Rows\",\"D4\",\"H5\")","v":"H5"}]
[null,{"$f":"IF($C$9=\"By Rows\",\"D5\",\"A6\")","v":"A6"}]
[null,{"$f":"IF($C$9=\"By Rows\",\"D6\",\"B6\")","v":"B6"}]
[null,{"$f":"IF($C$9=\"By Rows\",\"D7\",\"C6\")","v":"C6"}]
[null,{"$f":"IF($C$9=\"By Rows\",\"D8\",\"D6\")","v":"D6"}]
[null,{"$f":"IF($C$9=\"By Rows\",\"D9\",\"E6\")","v":"E6"}]
[null,{"$f":"IF($C$9=\"By Rows\",\"D10\",\"F6\")","v":"F6"}]
[null,{"$f":"IF($C$9=\"By Rows\",\"D11\",\"G6\")","v":"G6"}]
[null,{"$f":"IF($C$9=\"By Rows\",\"D12\",\"H6\")","v":"H6"}]
[null,{"$f":"IF($C$9=\"By Rows\",\"E1\",\"A7\")","v":"A7"}]
[null,{"$f":"IF($C$9=\"By Rows\",\"E2\",\"B7\")","v":"B7"}]
[null,{"$f":"IF($C$9=\"By Rows\",\"E3\",\"C7\")","v":"C7"}]
[null,{"$f":"IF($C$9=\"By Rows\",\"E4\",\"D7\")","v":"D7"}]
[null,{"$f":"IF($C$9=\"By Rows\",\"E5\",\"E7\")","v":"E7"}]
[null,{"$f":"IF($C$9=\"By Rows\",\"E6\",\"F7\")","v":"F7"}]
[null,{"$f":"IF($C$9=\"By Rows\",\"E7\",\"G7\")","v":"G7"}]
[null,{"$f":"IF($C$9=\"By Rows\",\"E8\",\"H7\")","v":"H7"}]
[null,{"$f":"IF($C$9=\"By Rows\",\"E9\",\"A8\")","v":"A8"}]
[null,{"$f":"IF($C$9=\"By Rows\",\"E10\",\"B8\")","v":"B8"}]
[null,{"$f":"IF($C$9=\"By Rows\",\"E11\",\"C8\")","v":"C8"}]
[null,{"$f":"IF($C$9=\"By Rows\",\"E12\",\"D8\")","v":"D8"}]
[null,{"$f":"IF($C$9=\"By Rows\",\"F1\",\"E8\")","v":"E8"}]
[null,{"$f":"IF($C$9=\"By Rows\",\"F2\",\"F8\")","v":"F8"}]
[null,{"$f":"IF($C$9=\"By Rows\",\"F3\",\"G8\")","v":"G8"}]
[null,{"$f":"IF($C$9=\"By Rows\",\"F4\",\"H8\")","v":"H8"}]
[null,{"$f":"IF($C$9=\"By Rows\",\"F5\",\"A9\")","v":"A9"}]
[null,{"$f":"IF($C$9=\"By Rows\",\"F6\",\"B9\")","v":"B9"}]
[null,{"$f":"IF($C$9=\"By Rows\",\"F7\",\"C9\")","v":"C9"}]
[null,{"$f":"IF($C$9=\"By Rows\",\"F8\",\"D9\")","v":"D9"}]
[null,{"$f":"IF($C$9=\"By Rows\",\"F9\",\"E9\")","v":"E9"}]
[null,{"$f":"IF($C$9=\"By Rows\",\"F10\",\"F9\")","v":"F9"}]
[null,{"$f":"IF($C$9=\"By Rows\",\"F11\",\"G9\")","v":"G9"}]
[null,{"$f":"IF($C$9=\"By Rows\",\"F12\",\"H9\")","v":"H9"}]
[null,{"$f":"IF($C$9=\"By Rows\",\"G1\",\"A10\")","v":"A10"}]
[null,{"$f":"IF($C$9=\"By Rows\",\"G2\",\"B10\")","v":"B10"}]
[null,{"$f":"IF($C$9=\"By Rows\",\"G3\",\"C10\")","v":"C10"}]
[null,{"$f":"IF($C$9=\"By Rows\",\"G4\",\"D10\")","v":"D10"}]
[null,{"$f":"IF($C$9=\"By Rows\",\"G5\",\"E10\")","v":"E10"}]
[null,{"$f":"IF($C$9=\"By Rows\",\"G6\",\"F10\")","v":"F10"}]
[null,{"$f":"IF($C$9=\"By Rows\",\"G7\",\"G10\")","v":"G10"}]
[null,{"$f":"IF($C$9=\"By Rows\",\"G8\",\"H10\")","v":"H10"}]
[null,{"$f":"IF($C$9=\"By Rows\",\"G9\",\"A11\")","v":"A11"}]
[null,{"$f":"IF($C$9=\"By Rows\",\"G10\",\"B11\")","v":"B11"}]
[null,{"$f":"IF($C$9=\"By Rows\",\"G11\",\"C11\")","v":"C11"}]
[null,{"$f":"IF($C$9=\"By Rows\",\"G12\",\"D11\")","v":"D11"}]
[null,{"$f":"IF($C$9=\"By Rows\",\"H1\",\"E11\")","v":"E11"}]
[null,{"$f":"IF($C$9=\"By Rows\",\"H2\",\"F11\")","v":"F11"}]
[null,{"$f":"IF($C$9=\"By Rows\",\"H3\",\"G11\")","v":"G11"}]
[null,{"$f":"IF($C$9=\"By Rows\",\"H4\",\"H11\")","v":"H11"}]
[null,{"$f":"IF($C$9=\"By Rows\",\"H5\",\"A12\")","v":"A12"},{"$nulls":6}," "]
[null,{"$f":"IF($C$9=\"By Rows\",\"H6\",\"B12\")","v":"B12"}]
[null,{"$f":"IF($C$9=\"By Rows\",\"H7\",\"C12\")","v":"C12"}]
[null,{"$f":"IF($C$9=\"By Rows\",\"H8\",\"D12\")","v":"D12"}]
[null,{"$f":"IF($C$9=\"By Rows\",\"H9\",\"E12\")","v":"E12"}]
[null,{"$f":"IF($C$9=\"By Rows\",\"H10\",\"F12\")","v":"F12"}]
[null,{"$f":"IF($C$9=\"By Rows\",\"H11\",\"G12\")","v":"G12"}]
[null,"H12"]

{"sheet":"Plate03","index":5,"n_rows":108,"n_cols":9,"rows_kept":108,"cut":false,"hidden":false,"merged":[[4,1,4,2]]}
[]
[null,"ShortSeq Plate (formerly Express Plate)"]
[null,"Upload Form"]
[]
[null,"Plate Information"]
[null,"Plate Barcode:",null,null,null,"Mandatory"]
[null,"Sample Type:",null,null,null,"Optional"]
[null,{"$f":"IF(C7=\"PCR Products\", \"Product Length:\", \"Construct Size:\")","v":"Construct Size:"}]
[null,"Sort Plate:","By Columns"]
[]
[]
[null,"Well Position","Sample Name                              "]
[null,"A1"]
[null,{"$f":"IF($C$9=\"By Rows\",\"A2\",\"B1\")","v":"B1"}]
[null,{"$f":"IF($C$9=\"By Rows\",\"A3\",\"C1\")","v":"C1"}]
[null,{"$f":"IF($C$9=\"By Rows\",\"A4\",\"D1\")","v":"D1"}]
[null,{"$f":"IF($C$9=\"By Rows\",\"A5\",\"E1\")","v":"E1"}]
[null,{"$f":"IF($C$9=\"By Rows\",\"A6\",\"F1\")","v":"F1"}]
[null,{"$f":"IF($C$9=\"By Rows\",\"A7\",\"G1\")","v":"G1"}]
[null,{"$f":"IF($C$9=\"By Rows\",\"A8\",\"H1\")","v":"H1"}]
[null,{"$f":"IF($C$9=\"By Rows\",\"A9\",\"A2\")","v":"A2"}]
[null,{"$f":"IF($C$9=\"By Rows\",\"A10\",\"B2\")","v":"B2"}]
[null,{"$f":"IF($C$9=\"By Rows\",\"A11\",\"C2\")","v":"C2"}]
[null,{"$f":"IF($C$9=\"By Rows\",\"A12\",\"D2\")","v":"D2"}]
[null,{"$f":"IF($C$9=\"By Rows\",\"B1\",\"E2\")","v":"E2"}]
[null,{"$f":"IF($C$9=\"By Rows\",\"B2\",\"F2\")","v":"F2"}]
[null,{"$f":"IF($C$9=\"By Rows\",\"B3\",\"G2\")","v":"G2"}]
[null,{"$f":"IF($C$9=\"By Rows\",\"B4\",\"H2\")","v":"H2"}]
[null,{"$f":"IF($C$9=\"By Rows\",\"B5\",\"A3\")","v":"A3"}]
[null,{"$f":"IF($C$9=\"By Rows\",\"B6\",\"B3\")","v":"B3"}]
[null,{"$f":"IF($C$9=\"By Rows\",\"B7\",\"C3\")","v":"C3"}]
[null,{"$f":"IF($C$9=\"By Rows\",\"B8\",\"D3\")","v":"D3"}]
[null,{"$f":"IF($C$9=\"By Rows\",\"B9\",\"E3\")","v":"E3"}]
[null,{"$f":"IF($C$9=\"By Rows\",\"B10\",\"F3\")","v":"F3"}]
[null,{"$f":"IF($C$9=\"By Rows\",\"B11\",\"G3\")","v":"G3"}]
[null,{"$f":"IF($C$9=\"By Rows\",\"B12\",\"H3\")","v":"H3"}]
[null,{"$f":"IF($C$9=\"By Rows\",\"C1\",\"A4\")","v":"A4"}]
[null,{"$f":"IF($C$9=\"By Rows\",\"C2\",\"B4\")","v":"B4"}]
[null,{"$f":"IF($C$9=\"By Rows\",\"C3\",\"C4\")","v":"C4"}]
[null,{"$f":"IF($C$9=\"By Rows\",\"C4\",\"D4\")","v":"D4"}]
[null,{"$f":"IF($C$9=\"By Rows\",\"C5\",\"E4\")","v":"E4"}]
[null,{"$f":"IF($C$9=\"By Rows\",\"C6\",\"F4\")","v":"F4"}]
[null,{"$f":"IF($C$9=\"By Rows\",\"C7\",\"G4\")","v":"G4"}]
[null,{"$f":"IF($C$9=\"By Rows\",\"C8\",\"H4\")","v":"H4"}]
[null,{"$f":"IF($C$9=\"By Rows\",\"C9\",\"A5\")","v":"A5"}]
[null,{"$f":"IF($C$9=\"By Rows\",\"C10\",\"B5\")","v":"B5"}]
[null,{"$f":"IF($C$9=\"By Rows\",\"C11\",\"C5\")","v":"C5"}]
[null,{"$f":"IF($C$9=\"By Rows\",\"C12\",\"D5\")","v":"D5"}]
[null,{"$f":"IF($C$9=\"By Rows\",\"D1\",\"E5\")","v":"E5"}]
[null,{"$f":"IF($C$9=\"By Rows\",\"D2\",\"F5\")","v":"F5"}]
[null,{"$f":"IF($C$9=\"By Rows\",\"D3\",\"G5\")","v":"G5"}]
[null,{"$f":"IF($C$9=\"By Rows\",\"D4\",\"H5\")","v":"H5"}]
[null,{"$f":"IF($C$9=\"By Rows\",\"D5\",\"A6\")","v":"A6"}]
[null,{"$f":"IF($C$9=\"By Rows\",\"D6\",\"B6\")","v":"B6"}]
[null,{"$f":"IF($C$9=\"By Rows\",\"D7\",\"C6\")","v":"C6"}]
[null,{"$f":"IF($C$9=\"By Rows\",\"D8\",\"D6\")","v":"D6"}]
[null,{"$f":"IF($C$9=\"By Rows\",\"D9\",\"E6\")","v":"E6"}]
[null,{"$f":"IF($C$9=\"By Rows\",\"D10\",\"F6\")","v":"F6"}]
[null,{"$f":"IF($C$9=\"By Rows\",\"D11\",\"G6\")","v":"G6"}]
[null,{"$f":"IF($C$9=\"By Rows\",\"D12\",\"H6\")","v":"H6"}]
[null,{"$f":"IF($C$9=\"By Rows\",\"E1\",\"A7\")","v":"A7"}]
[null,{"$f":"IF($C$9=\"By Rows\",\"E2\",\"B7\")","v":"B7"}]
[null,{"$f":"IF($C$9=\"By Rows\",\"E3\",\"C7\")","v":"C7"}]
[null,{"$f":"IF($C$9=\"By Rows\",\"E4\",\"D7\")","v":"D7"}]
[null,{"$f":"IF($C$9=\"By Rows\",\"E5\",\"E7\")","v":"E7"}]
[null,{"$f":"IF($C$9=\"By Rows\",\"E6\",\"F7\")","v":"F7"}]
[null,{"$f":"IF($C$9=\"By Rows\",\"E7\",\"G7\")","v":"G7"}]
[null,{"$f":"IF($C$9=\"By Rows\",\"E8\",\"H7\")","v":"H7"}]
[null,{"$f":"IF($C$9=\"By Rows\",\"E9\",\"A8\")","v":"A8"}]
[null,{"$f":"IF($C$9=\"By Rows\",\"E10\",\"B8\")","v":"B8"}]
[null,{"$f":"IF($C$9=\"By Rows\",\"E11\",\"C8\")","v":"C8"}]
[null,{"$f":"IF($C$9=\"By Rows\",\"E12\",\"D8\")","v":"D8"}]
[null,{"$f":"IF($C$9=\"By Rows\",\"F1\",\"E8\")","v":"E8"}]
[null,{"$f":"IF($C$9=\"By Rows\",\"F2\",\"F8\")","v":"F8"}]
[null,{"$f":"IF($C$9=\"By Rows\",\"F3\",\"G8\")","v":"G8"}]
[null,{"$f":"IF($C$9=\"By Rows\",\"F4\",\"H8\")","v":"H8"}]
[null,{"$f":"IF($C$9=\"By Rows\",\"F5\",\"A9\")","v":"A9"}]
[null,{"$f":"IF($C$9=\"By Rows\",\"F6\",\"B9\")","v":"B9"}]
[null,{"$f":"IF($C$9=\"By Rows\",\"F7\",\"C9\")","v":"C9"}]
[null,{"$f":"IF($C$9=\"By Rows\",\"F8\",\"D9\")","v":"D9"}]
[null,{"$f":"IF($C$9=\"By Rows\",\"F9\",\"E9\")","v":"E9"}]
[null,{"$f":"IF($C$9=\"By Rows\",\"F10\",\"F9\")","v":"F9"}]
[null,{"$f":"IF($C$9=\"By Rows\",\"F11\",\"G9\")","v":"G9"}]
[null,{"$f":"IF($C$9=\"By Rows\",\"F12\",\"H9\")","v":"H9"}]
[null,{"$f":"IF($C$9=\"By Rows\",\"G1\",\"A10\")","v":"A10"}]
[null,{"$f":"IF($C$9=\"By Rows\",\"G2\",\"B10\")","v":"B10"}]
[null,{"$f":"IF($C$9=\"By Rows\",\"G3\",\"C10\")","v":"C10"}]
[null,{"$f":"IF($C$9=\"By Rows\",\"G4\",\"D10\")","v":"D10"}]
[null,{"$f":"IF($C$9=\"By Rows\",\"G5\",\"E10\")","v":"E10"}]
[null,{"$f":"IF($C$9=\"By Rows\",\"G6\",\"F10\")","v":"F10"}]
[null,{"$f":"IF($C$9=\"By Rows\",\"G7\",\"G10\")","v":"G10"}]
[null,{"$f":"IF($C$9=\"By Rows\",\"G8\",\"H10\")","v":"H10"}]
[null,{"$f":"IF($C$9=\"By Rows\",\"G9\",\"A11\")","v":"A11"}]
[null,{"$f":"IF($C$9=\"By Rows\",\"G10\",\"B11\")","v":"B11"}]
[null,{"$f":"IF($C$9=\"By Rows\",\"G11\",\"C11\")","v":"C11"}]
[null,{"$f":"IF($C$9=\"By Rows\",\"G12\",\"D11\")","v":"D11"}]
[null,{"$f":"IF($C$9=\"By Rows\",\"H1\",\"E11\")","v":"E11"}]
[null,{"$f":"IF($C$9=\"By Rows\",\"H2\",\"F11\")","v":"F11"}]
[null,{"$f":"IF($C$9=\"By Rows\",\"H3\",\"G11\")","v":"G11"}]
[null,{"$f":"IF($C$9=\"By Rows\",\"H4\",\"H11\")","v":"H11"}]
[null,{"$f":"IF($C$9=\"By Rows\",\"H5\",\"A12\")","v":"A12"},{"$nulls":6}," "]
[null,{"$f":"IF($C$9=\"By Rows\",\"H6\",\"B12\")","v":"B12"}]
[null,{"$f":"IF($C$9=\"By Rows\",\"H7\",\"C12\")","v":"C12"}]
[null,{"$f":"IF($C$9=\"By Rows\",\"H8\",\"D12\")","v":"D12"}]
[null,{"$f":"IF($C$9=\"By Rows\",\"H9\",\"E12\")","v":"E12"}]
[null,{"$f":"IF($C$9=\"By Rows\",\"H10\",\"F12\")","v":"F12"}]
[null,{"$f":"IF($C$9=\"By Rows\",\"H11\",\"G12\")","v":"G12"}]
[null,"H12"]

{"sheet":"Plate04","index":6,"n_rows":108,"n_cols":9,"rows_kept":108,"cut":false,"hidden":false,"merged":[[4,1,4,2]]}
[]
[null,"ShortSeq Plate (formerly Express Plate)"]
[null,"Upload Form"]
[]
[null,"Plate Information"]
[null,"Plate Barcode:"]
[null,"Sample Type:",null,null,null,"Mandatory"]
[null,{"$f":"IF(C7=\"PCR Products\", \"Product Length:\", \"Construct Size:\")","v":"Construct Size:"},null,null,null,"Optional"]
[null,"Sort Plate:","By Columns"]
[]
[]
[null,"Well Position","Sample Name                              "]
[null,"A1"]
[null,{"$f":"IF($C$9=\"By Rows\",\"A2\",\"B1\")","v":"B1"}]
[null,{"$f":"IF($C$9=\"By Rows\",\"A3\",\"C1\")","v":"C1"}]
[null,{"$f":"IF($C$9=\"By Rows\",\"A4\",\"D1\")","v":"D1"}]
[null,{"$f":"IF($C$9=\"By Rows\",\"A5\",\"E1\")","v":"E1"}]
[null,{"$f":"IF($C$9=\"By Rows\",\"A6\",\"F1\")","v":"F1"}]
[null,{"$f":"IF($C$9=\"By Rows\",\"A7\",\"G1\")","v":"G1"}]
[null,{"$f":"IF($C$9=\"By Rows\",\"A8\",\"H1\")","v":"H1"}]
[null,{"$f":"IF($C$9=\"By Rows\",\"A9\",\"A2\")","v":"A2"}]
[null,{"$f":"IF($C$9=\"By Rows\",\"A10\",\"B2\")","v":"B2"}]
[null,{"$f":"IF($C$9=\"By Rows\",\"A11\",\"C2\")","v":"C2"}]
[null,{"$f":"IF($C$9=\"By Rows\",\"A12\",\"D2\")","v":"D2"}]
[null,{"$f":"IF($C$9=\"By Rows\",\"B1\",\"E2\")","v":"E2"}]
[null,{"$f":"IF($C$9=\"By Rows\",\"B2\",\"F2\")","v":"F2"}]
[null,{"$f":"IF($C$9=\"By Rows\",\"B3\",\"G2\")","v":"G2"}]
[null,{"$f":"IF($C$9=\"By Rows\",\"B4\",\"H2\")","v":"H2"}]
[null,{"$f":"IF($C$9=\"By Rows\",\"B5\",\"A3\")","v":"A3"}]
[null,{"$f":"IF($C$9=\"By Rows\",\"B6\",\"B3\")","v":"B3"}]
[null,{"$f":"IF($C$9=\"By Rows\",\"B7\",\"C3\")","v":"C3"}]
[null,{"$f":"IF($C$9=\"By Rows\",\"B8\",\"D3\")","v":"D3"}]
[null,{"$f":"IF($C$9=\"By Rows\",\"B9\",\"E3\")","v":"E3"}]
[null,{"$f":"IF($C$9=\"By Rows\",\"B10\",\"F3\")","v":"F3"}]
[null,{"$f":"IF($C$9=\"By Rows\",\"B11\",\"G3\")","v":"G3"}]
[null,{"$f":"IF($C$9=\"By Rows\",\"B12\",\"H3\")","v":"H3"}]
[null,{"$f":"IF($C$9=\"By Rows\",\"C1\",\"A4\")","v":"A4"}]
[null,{"$f":"IF($C$9=\"By Rows\",\"C2\",\"B4\")","v":"B4"}]
[null,{"$f":"IF($C$9=\"By Rows\",\"C3\",\"C4\")","v":"C4"}]
[null,{"$f":"IF($C$9=\"By Rows\",\"C4\",\"D4\")","v":"D4"}]
[null,{"$f":"IF($C$9=\"By Rows\",\"C5\",\"E4\")","v":"E4"}]
[null,{"$f":"IF($C$9=\"By Rows\",\"C6\",\"F4\")","v":"F4"}]
[null,{"$f":"IF($C$9=\"By Rows\",\"C7\",\"G4\")","v":"G4"}]
[null,{"$f":"IF($C$9=\"By Rows\",\"C8\",\"H4\")","v":"H4"}]
[null,{"$f":"IF($C$9=\"By Rows\",\"C9\",\"A5\")","v":"A5"}]
[null,{"$f":"IF($C$9=\"By Rows\",\"C10\",\"B5\")","v":"B5"}]
[null,{"$f":"IF($C$9=\"By Rows\",\"C11\",\"C5\")","v":"C5"}]
[null,{"$f":"IF($C$9=\"By Rows\",\"C12\",\"D5\")","v":"D5"}]
[null,{"$f":"IF($C$9=\"By Rows\",\"D1\",\"E5\")","v":"E5"}]
[null,{"$f":"IF($C$9=\"By Rows\",\"D2\",\"F5\")","v":"F5"}]
[null,{"$f":"IF($C$9=\"By Rows\",\"D3\",\"G5\")","v":"G5"}]
[null,{"$f":"IF($C$9=\"By Rows\",\"D4\",\"H5\")","v":"H5"}]
[null,{"$f":"IF($C$9=\"By Rows\",\"D5\",\"A6\")","v":"A6"}]
[null,{"$f":"IF($C$9=\"By Rows\",\"D6\",\"B6\")","v":"B6"}]
[null,{"$f":"IF($C$9=\"By Rows\",\"D7\",\"C6\")","v":"C6"}]
[null,{"$f":"IF($C$9=\"By Rows\",\"D8\",\"D6\")","v":"D6"}]
[null,{"$f":"IF($C$9=\"By Rows\",\"D9\",\"E6\")","v":"E6"}]
[null,{"$f":"IF($C$9=\"By Rows\",\"D10\",\"F6\")","v":"F6"}]
[null,{"$f":"IF($C$9=\"By Rows\",\"D11\",\"G6\")","v":"G6"}]
[null,{"$f":"IF($C$9=\"By Rows\",\"D12\",\"H6\")","v":"H6"}]
[null,{"$f":"IF($C$9=\"By Rows\",\"E1\",\"A7\")","v":"A7"}]
[null,{"$f":"IF($C$9=\"By Rows\",\"E2\",\"B7\")","v":"B7"}]
[null,{"$f":"IF($C$9=\"By Rows\",\"E3\",\"C7\")","v":"C7"}]
[null,{"$f":"IF($C$9=\"By Rows\",\"E4\",\"D7\")","v":"D7"}]
[null,{"$f":"IF($C$9=\"By Rows\",\"E5\",\"E7\")","v":"E7"}]
[null,{"$f":"IF($C$9=\"By Rows\",\"E6\",\"F7\")","v":"F7"}]
[null,{"$f":"IF($C$9=\"By Rows\",\"E7\",\"G7\")","v":"G7"}]
[null,{"$f":"IF($C$9=\"By Rows\",\"E8\",\"H7\")","v":"H7"}]
[null,{"$f":"IF($C$9=\"By Rows\",\"E9\",\"A8\")","v":"A8"}]
[null,{"$f":"IF($C$9=\"By Rows\",\"E10\",\"B8\")","v":"B8"}]
[null,{"$f":"IF($C$9=\"By Rows\",\"E11\",\"C8\")","v":"C8"}]
[null,{"$f":"IF($C$9=\"By Rows\",\"E12\",\"D8\")","v":"D8"}]
[null,{"$f":"IF($C$9=\"By Rows\",\"F1\",\"E8\")","v":"E8"}]
[null,{"$f":"IF($C$9=\"By Rows\",\"F2\",\"F8\")","v":"F8"}]
[null,{"$f":"IF($C$9=\"By Rows\",\"F3\",\"G8\")","v":"G8"}]
[null,{"$f":"IF($C$9=\"By Rows\",\"F4\",\"H8\")","v":"H8"}]
[null,{"$f":"IF($C$9=\"By Rows\",\"F5\",\"A9\")","v":"A9"}]
[null,{"$f":"IF($C$9=\"By Rows\",\"F6\",\"B9\")","v":"B9"}]
[null,{"$f":"IF($C$9=\"By Rows\",\"F7\",\"C9\")","v":"C9"}]
[null,{"$f":"IF($C$9=\"By Rows\",\"F8\",\"D9\")","v":"D9"}]
[null,{"$f":"IF($C$9=\"By Rows\",\"F9\",\"E9\")","v":"E9"}]
[null,{"$f":"IF($C$9=\"By Rows\",\"F10\",\"F9\")","v":"F9"}]
[null,{"$f":"IF($C$9=\"By Rows\",\"F11\",\"G9\")","v":"G9"}]
[null,{"$f":"IF($C$9=\"By Rows\",\"F12\",\"H9\")","v":"H9"}]
[null,{"$f":"IF($C$9=\"By Rows\",\"G1\",\"A10\")","v":"A10"}]
[null,{"$f":"IF($C$9=\"By Rows\",\"G2\",\"B10\")","v":"B10"}]
[null,{"$f":"IF($C$9=\"By Rows\",\"G3\",\"C10\")","v":"C10"}]
[null,{"$f":"IF($C$9=\"By Rows\",\"G4\",\"D10\")","v":"D10"}]
[null,{"$f":"IF($C$9=\"By Rows\",\"G5\",\"E10\")","v":"E10"}]
[null,{"$f":"IF($C$9=\"By Rows\",\"G6\",\"F10\")","v":"F10"}]
[null,{"$f":"IF($C$9=\"By Rows\",\"G7\",\"G10\")","v":"G10"}]
[null,{"$f":"IF($C$9=\"By Rows\",\"G8\",\"H10\")","v":"H10"}]
[null,{"$f":"IF($C$9=\"By Rows\",\"G9\",\"A11\")","v":"A11"}]
[null,{"$f":"IF($C$9=\"By Rows\",\"G10\",\"B11\")","v":"B11"}]
[null,{"$f":"IF($C$9=\"By Rows\",\"G11\",\"C11\")","v":"C11"}]
[null,{"$f":"IF($C$9=\"By Rows\",\"G12\",\"D11\")","v":"D11"}]
[null,{"$f":"IF($C$9=\"By Rows\",\"H1\",\"E11\")","v":"E11"}]
[null,{"$f":"IF($C$9=\"By Rows\",\"H2\",\"F11\")","v":"F11"}]
[null,{"$f":"IF($C$9=\"By Rows\",\"H3\",\"G11\")","v":"G11"}]
[null,{"$f":"IF($C$9=\"By Rows\",\"H4\",\"H11\")","v":"H11"}]
[null,{"$f":"IF($C$9=\"By Rows\",\"H5\",\"A12\")","v":"A12"},{"$nulls":6}," "]
[null,{"$f":"IF($C$9=\"By Rows\",\"H6\",\"B12\")","v":"B12"}]
[null,{"$f":"IF($C$9=\"By Rows\",\"H7\",\"C12\")","v":"C12"}]
[null,{"$f":"IF($C$9=\"By Rows\",\"H8\",\"D12\")","v":"D12"}]
[null,{"$f":"IF($C$9=\"By Rows\",\"H9\",\"E12\")","v":"E12"}]
[null,{"$f":"IF($C$9=\"By Rows\",\"H10\",\"F12\")","v":"F12"}]
[null,{"$f":"IF($C$9=\"By Rows\",\"H11\",\"G12\")","v":"G12"}]
[null,"H12"]

{"sheet":"Plate05","index":7,"n_rows":108,"n_cols":9,"rows_kept":108,"cut":false,"hidden":false,"merged":[[4,1,4,2]]}
[]
[null,"ShortSeq Plate (formerly Express Plate)"]
[null,"Upload Form"]
[]
[null,"Plate Information"]
[null,"Plate Barcode:"]
[null,"Sample Type:",null,null,null,"Mandatory"]
[null,{"$f":"IF(C7=\"PCR Products\", \"Product Length:\", \"Construct Size:\")","v":"Construct Size:"},null,null,null,"Optional"]
[null,"Sort Plate:","By Columns"]
[]
[]
[null,"Well Position","Sample Name                              "]
[null,"A1"]
[null,{"$f":"IF($C$9=\"By Rows\",\"A2\",\"B1\")","v":"B1"}]
[null,{"$f":"IF($C$9=\"By Rows\",\"A3\",\"C1\")","v":"C1"}]
[null,{"$f":"IF($C$9=\"By Rows\",\"A4\",\"D1\")","v":"D1"}]
[null,{"$f":"IF($C$9=\"By Rows\",\"A5\",\"E1\")","v":"E1"}]
[null,{"$f":"IF($C$9=\"By Rows\",\"A6\",\"F1\")","v":"F1"}]
[null,{"$f":"IF($C$9=\"By Rows\",\"A7\",\"G1\")","v":"G1"}]
[null,{"$f":"IF($C$9=\"By Rows\",\"A8\",\"H1\")","v":"H1"}]
[null,{"$f":"IF($C$9=\"By Rows\",\"A9\",\"A2\")","v":"A2"}]
[null,{"$f":"IF($C$9=\"By Rows\",\"A10\",\"B2\")","v":"B2"}]
[null,{"$f":"IF($C$9=\"By Rows\",\"A11\",\"C2\")","v":"C2"}]
[null,{"$f":"IF($C$9=\"By Rows\",\"A12\",\"D2\")","v":"D2"}]
[null,{"$f":"IF($C$9=\"By Rows\",\"B1\",\"E2\")","v":"E2"}]
[null,{"$f":"IF($C$9=\"By Rows\",\"B2\",\"F2\")","v":"F2"}]
[null,{"$f":"IF($C$9=\"By Rows\",\"B3\",\"G2\")","v":"G2"}]
[null,{"$f":"IF($C$9=\"By Rows\",\"B4\",\"H2\")","v":"H2"}]
[null,{"$f":"IF($C$9=\"By Rows\",\"B5\",\"A3\")","v":"A3"}]
[null,{"$f":"IF($C$9=\"By Rows\",\"B6\",\"B3\")","v":"B3"}]
[null,{"$f":"IF($C$9=\"By Rows\",\"B7\",\"C3\")","v":"C3"}]
[null,{"$f":"IF($C$9=\"By Rows\",\"B8\",\"D3\")","v":"D3"}]
[null,{"$f":"IF($C$9=\"By Rows\",\"B9\",\"E3\")","v":"E3"}]
[null,{"$f":"IF($C$9=\"By Rows\",\"B10\",\"F3\")","v":"F3"}]
[null,{"$f":"IF($C$9=\"By Rows\",\"B11\",\"G3\")","v":"G3"}]
[null,{"$f":"IF($C$9=\"By Rows\",\"B12\",\"H3\")","v":"H3"}]
[null,{"$f":"IF($C$9=\"By Rows\",\"C1\",\"A4\")","v":"A4"}]
[null,{"$f":"IF($C$9=\"By Rows\",\"C2\",\"B4\")","v":"B4"}]
[null,{"$f":"IF($C$9=\"By Rows\",\"C3\",\"C4\")","v":"C4"}]
[null,{"$f":"IF($C$9=\"By Rows\",\"C4\",\"D4\")","v":"D4"}]
[null,{"$f":"IF($C$9=\"By Rows\",\"C5\",\"E4\")","v":"E4"}]
[null,{"$f":"IF($C$9=\"By Rows\",\"C6\",\"F4\")","v":"F4"}]
[null,{"$f":"IF($C$9=\"By Rows\",\"C7\",\"G4\")","v":"G4"}]
[null,{"$f":"IF($C$9=\"By Rows\",\"C8\",\"H4\")","v":"H4"}]
[null,{"$f":"IF($C$9=\"By Rows\",\"C9\",\"A5\")","v":"A5"}]
[null,{"$f":"IF($C$9=\"By Rows\",\"C10\",\"B5\")","v":"B5"}]
[null,{"$f":"IF($C$9=\"By Rows\",\"C11\",\"C5\")","v":"C5"}]
[null,{"$f":"IF($C$9=\"By Rows\",\"C12\",\"D5\")","v":"D5"}]
[null,{"$f":"IF($C$9=\"By Rows\",\"D1\",\"E5\")","v":"E5"}]
[null,{"$f":"IF($C$9=\"By Rows\",\"D2\",\"F5\")","v":"F5"}]
[null,{"$f":"IF($C$9=\"By Rows\",\"D3\",\"G5\")","v":"G5"}]
[null,{"$f":"IF($C$9=\"By Rows\",\"D4\",\"H5\")","v":"H5"}]
[null,{"$f":"IF($C$9=\"By Rows\",\"D5\",\"A6\")","v":"A6"}]
[null,{"$f":"IF($C$9=\"By Rows\",\"D6\",\"B6\")","v":"B6"}]
[null,{"$f":"IF($C$9=\"By Rows\",\"D7\",\"C6\")","v":"C6"}]
[null,{"$f":"IF($C$9=\"By Rows\",\"D8\",\"D6\")","v":"D6"}]
[null,{"$f":"IF($C$9=\"By Rows\",\"D9\",\"E6\")","v":"E6"}]
[null,{"$f":"IF($C$9=\"By Rows\",\"D10\",\"F6\")","v":"F6"}]
[null,{"$f":"IF($C$9=\"By Rows\",\"D11\",\"G6\")","v":"G6"}]
[null,{"$f":"IF($C$9=\"By Rows\",\"D12\",\"H6\")","v":"H6"}]
[null,{"$f":"IF($C$9=\"By Rows\",\"E1\",\"A7\")","v":"A7"}]
[null,{"$f":"IF($C$9=\"By Rows\",\"E2\",\"B7\")","v":"B7"}]
[null,{"$f":"IF($C$9=\"By Rows\",\"E3\",\"C7\")","v":"C7"}]
[null,{"$f":"IF($C$9=\"By Rows\",\"E4\",\"D7\")","v":"D7"}]
[null,{"$f":"IF($C$9=\"By Rows\",\"E5\",\"E7\")","v":"E7"}]
[null,{"$f":"IF($C$9=\"By Rows\",\"E6\",\"F7\")","v":"F7"}]
[null,{"$f":"IF($C$9=\"By Rows\",\"E7\",\"G7\")","v":"G7"}]
[null,{"$f":"IF($C$9=\"By Rows\",\"E8\",\"H7\")","v":"H7"}]
[null,{"$f":"IF($C$9=\"By Rows\",\"E9\",\"A8\")","v":"A8"}]
[null,{"$f":"IF($C$9=\"By Rows\",\"E10\",\"B8\")","v":"B8"}]
[null,{"$f":"IF($C$9=\"By Rows\",\"E11\",\"C8\")","v":"C8"}]
[null,{"$f":"IF($C$9=\"By Rows\",\"E12\",\"D8\")","v":"D8"}]
[null,{"$f":"IF($C$9=\"By Rows\",\"F1\",\"E8\")","v":"E8"}]
[null,{"$f":"IF($C$9=\"By Rows\",\"F2\",\"F8\")","v":"F8"}]
[null,{"$f":"IF($C$9=\"By Rows\",\"F3\",\"G8\")","v":"G8"}]
[null,{"$f":"IF($C$9=\"By Rows\",\"F4\",\"H8\")","v":"H8"}]
[null,{"$f":"IF($C$9=\"By Rows\",\"F5\",\"A9\")","v":"A9"}]
[null,{"$f":"IF($C$9=\"By Rows\",\"F6\",\"B9\")","v":"B9"}]
[null,{"$f":"IF($C$9=\"By Rows\",\"F7\",\"C9\")","v":"C9"}]
[null,{"$f":"IF($C$9=\"By Rows\",\"F8\",\"D9\")","v":"D9"}]
[null,{"$f":"IF($C$9=\"By Rows\",\"F9\",\"E9\")","v":"E9"}]
[null,{"$f":"IF($C$9=\"By Rows\",\"F10\",\"F9\")","v":"F9"}]
[null,{"$f":"IF($C$9=\"By Rows\",\"F11\",\"G9\")","v":"G9"}]
[null,{"$f":"IF($C$9=\"By Rows\",\"F12\",\"H9\")","v":"H9"}]
[null,{"$f":"IF($C$9=\"By Rows\",\"G1\",\"A10\")","v":"A10"}]
[null,{"$f":"IF($C$9=\"By Rows\",\"G2\",\"B10\")","v":"B10"}]
[null,{"$f":"IF($C$9=\"By Rows\",\"G3\",\"C10\")","v":"C10"}]
[null,{"$f":"IF($C$9=\"By Rows\",\"G4\",\"D10\")","v":"D10"}]
[null,{"$f":"IF($C$9=\"By Rows\",\"G5\",\"E10\")","v":"E10"}]
[null,{"$f":"IF($C$9=\"By Rows\",\"G6\",\"F10\")","v":"F10"}]
[null,{"$f":"IF($C$9=\"By Rows\",\"G7\",\"G10\")","v":"G10"}]
[null,{"$f":"IF($C$9=\"By Rows\",\"G8\",\"H10\")","v":"H10"}]
[null,{"$f":"IF($C$9=\"By Rows\",\"G9\",\"A11\")","v":"A11"}]
[null,{"$f":"IF($C$9=\"By Rows\",\"G10\",\"B11\")","v":"B11"}]
[null,{"$f":"IF($C$9=\"By Rows\",\"G11\",\"C11\")","v":"C11"}]
[null,{"$f":"IF($C$9=\"By Rows\",\"G12\",\"D11\")","v":"D11"}]
[null,{"$f":"IF($C$9=\"By Rows\",\"H1\",\"E11\")","v":"E11"}]
[null,{"$f":"IF($C$9=\"By Rows\",\"H2\",\"F11\")","v":"F11"}]
[null,{"$f":"IF($C$9=\"By Rows\",\"H3\",\"G11\")","v":"G11"}]
[null,{"$f":"IF($C$9=\"By Rows\",\"H4\",\"H11\")","v":"H11"}]
[null,{"$f":"IF($C$9=\"By Rows\",\"H5\",\"A12\")","v":"A12"},{"$nulls":6}," "]
[null,{"$f":"IF($C$9=\"By Rows\",\"H6\",\"B12\")","v":"B12"}]
[null,{"$f":"IF($C$9=\"By Rows\",\"H7\",\"C12\")","v":"C12"}]
[null,{"$f":"IF($C$9=\"By Rows\",\"H8\",\"D12\")","v":"D12"}]
[null,{"$f":"IF($C$9=\"By Rows\",\"H9\",\"E12\")","v":"E12"}]
[null,{"$f":"IF($C$9=\"By Rows\",\"H10\",\"F12\")","v":"F12"}]
[null,{"$f":"IF($C$9=\"By Rows\",\"H11\",\"G12\")","v":"G12"}]
[null,"H12"]

{"sheet":"Plate06","index":8,"n_rows":108,"n_cols":9,"rows_kept":108,"cut":false,"hidden":false,"merged":[[4,1,4,2]]}
[]
[null,"ShortSeq Plate (formerly Express Plate)"]
[null,"Upload Form"]
[]
[null,"Plate Information"]
[null,"Plate Barcode:",null,null,null,"Mandatory"]
[null,"Sample Type:",null,null,null,"Optional"]
[null,{"$f":"IF(C7=\"PCR Products\", \"Product Length:\", \"Construct Size:\")","v":"Construct Size:"}]
[null,"Sort Plate:","By Columns"]
[]
[]
[null,"Well Position","Sample Name                              "]
[null,"A1"]
[null,{"$f":"IF($C$9=\"By Rows\",\"A2\",\"B1\")","v":"B1"}]
[null,{"$f":"IF($C$9=\"By Rows\",\"A3\",\"C1\")","v":"C1"}]
[null,{"$f":"IF($C$9=\"By Rows\",\"A4\",\"D1\")","v":"D1"}]
[null,{"$f":"IF($C$9=\"By Rows\",\"A5\",\"E1\")","v":"E1"}]
[null,{"$f":"IF($C$9=\"By Rows\",\"A6\",\"F1\")","v":"F1"}]
[null,{"$f":"IF($C$9=\"By Rows\",\"A7\",\"G1\")","v":"G1"}]
[null,{"$f":"IF($C$9=\"By Rows\",\"A8\",\"H1\")","v":"H1"}]
[null,{"$f":"IF($C$9=\"By Rows\",\"A9\",\"A2\")","v":"A2"}]
[null,{"$f":"IF($C$9=\"By Rows\",\"A10\",\"B2\")","v":"B2"}]
[null,{"$f":"IF($C$9=\"By Rows\",\"A11\",\"C2\")","v":"C2"}]
[null,{"$f":"IF($C$9=\"By Rows\",\"A12\",\"D2\")","v":"D2"}]
[null,{"$f":"IF($C$9=\"By Rows\",\"B1\",\"E2\")","v":"E2"}]
[null,{"$f":"IF($C$9=\"By Rows\",\"B2\",\"F2\")","v":"F2"}]
[null,{"$f":"IF($C$9=\"By Rows\",\"B3\",\"G2\")","v":"G2"}]
[null,{"$f":"IF($C$9=\"By Rows\",\"B4\",\"H2\")","v":"H2"}]
[null,{"$f":"IF($C$9=\"By Rows\",\"B5\",\"A3\")","v":"A3"}]
[null,{"$f":"IF($C$9=\"By Rows\",\"B6\",\"B3\")","v":"B3"}]
[null,{"$f":"IF($C$9=\"By Rows\",\"B7\",\"C3\")","v":"C3"}]
[null,{"$f":"IF($C$9=\"By Rows\",\"B8\",\"D3\")","v":"D3"}]
[null,{"$f":"IF($C$9=\"By Rows\",\"B9\",\"E3\")","v":"E3"}]
[null,{"$f":"IF($C$9=\"By Rows\",\"B10\",\"F3\")","v":"F3"}]
[null,{"$f":"IF($C$9=\"By Rows\",\"B11\",\"G3\")","v":"G3"}]
[null,{"$f":"IF($C$9=\"By Rows\",\"B12\",\"H3\")","v":"H3"}]
[null,{"$f":"IF($C$9=\"By Rows\",\"C1\",\"A4\")","v":"A4"}]
[null,{"$f":"IF($C$9=\"By Rows\",\"C2\",\"B4\")","v":"B4"}]
[null,{"$f":"IF($C$9=\"By Rows\",\"C3\",\"C4\")","v":"C4"}]
[null,{"$f":"IF($C$9=\"By Rows\",\"C4\",\"D4\")","v":"D4"}]
[null,{"$f":"IF($C$9=\"By Rows\",\"C5\",\"E4\")","v":"E4"}]
[null,{"$f":"IF($C$9=\"By Rows\",\"C6\",\"F4\")","v":"F4"}]
[null,{"$f":"IF($C$9=\"By Rows\",\"C7\",\"G4\")","v":"G4"}]
[null,{"$f":"IF($C$9=\"By Rows\",\"C8\",\"H4\")","v":"H4"}]
[null,{"$f":"IF($C$9=\"By Rows\",\"C9\",\"A5\")","v":"A5"}]
[null,{"$f":"IF($C$9=\"By Rows\",\"C10\",\"B5\")","v":"B5"}]
[null,{"$f":"IF($C$9=\"By Rows\",\"C11\",\"C5\")","v":"C5"}]
[null,{"$f":"IF($C$9=\"By Rows\",\"C12\",\"D5\")","v":"D5"}]
[null,{"$f":"IF($C$9=\"By Rows\",\"D1\",\"E5\")","v":"E5"}]
[null,{"$f":"IF($C$9=\"By Rows\",\"D2\",\"F5\")","v":"F5"}]
[null,{"$f":"IF($C$9=\"By Rows\",\"D3\",\"G5\")","v":"G5"}]
[null,{"$f":"IF($C$9=\"By Rows\",\"D4\",\"H5\")","v":"H5"}]
[null,{"$f":"IF($C$9=\"By Rows\",\"D5\",\"A6\")","v":"A6"}]
[null,{"$f":"IF($C$9=\"By Rows\",\"D6\",\"B6\")","v":"B6"}]
[null,{"$f":"IF($C$9=\"By Rows\",\"D7\",\"C6\")","v":"C6"}]
[null,{"$f":"IF($C$9=\"By Rows\",\"D8\",\"D6\")","v":"D6"}]
[null,{"$f":"IF($C$9=\"By Rows\",\"D9\",\"E6\")","v":"E6"}]
[null,{"$f":"IF($C$9=\"By Rows\",\"D10\",\"F6\")","v":"F6"}]
[null,{"$f":"IF($C$9=\"By Rows\",\"D11\",\"G6\")","v":"G6"}]
[null,{"$f":"IF($C$9=\"By Rows\",\"D12\",\"H6\")","v":"H6"}]
[null,{"$f":"IF($C$9=\"By Rows\",\"E1\",\"A7\")","v":"A7"}]
[null,{"$f":"IF($C$9=\"By Rows\",\"E2\",\"B7\")","v":"B7"}]
[null,{"$f":"IF($C$9=\"By Rows\",\"E3\",\"C7\")","v":"C7"}]
[null,{"$f":"IF($C$9=\"By Rows\",\"E4\",\"D7\")","v":"D7"}]
[null,{"$f":"IF($C$9=\"By Rows\",\"E5\",\"E7\")","v":"E7"}]
[null,{"$f":"IF($C$9=\"By Rows\",\"E6\",\"F7\")","v":"F7"}]
[null,{"$f":"IF($C$9=\"By Rows\",\"E7\",\"G7\")","v":"G7"}]
[null,{"$f":"IF($C$9=\"By Rows\",\"E8\",\"H7\")","v":"H7"}]
[null,{"$f":"IF($C$9=\"By Rows\",\"E9\",\"A8\")","v":"A8"}]
[null,{"$f":"IF($C$9=\"By Rows\",\"E10\",\"B8\")","v":"B8"}]
[null,{"$f":"IF($C$9=\"By Rows\",\"E11\",\"C8\")","v":"C8"}]
[null,{"$f":"IF($C$9=\"By Rows\",\"E12\",\"D8\")","v":"D8"}]
[null,{"$f":"IF($C$9=\"By Rows\",\"F1\",\"E8\")","v":"E8"}]
[null,{"$f":"IF($C$9=\"By Rows\",\"F2\",\"F8\")","v":"F8"}]
[null,{"$f":"IF($C$9=\"By Rows\",\"F3\",\"G8\")","v":"G8"}]
[null,{"$f":"IF($C$9=\"By Rows\",\"F4\",\"H8\")","v":"H8"}]
[null,{"$f":"IF($C$9=\"By Rows\",\"F5\",\"A9\")","v":"A9"}]
[null,{"$f":"IF($C$9=\"By Rows\",\"F6\",\"B9\")","v":"B9"}]
[null,{"$f":"IF($C$9=\"By Rows\",\"F7\",\"C9\")","v":"C9"}]
[null,{"$f":"IF($C$9=\"By Rows\",\"F8\",\"D9\")","v":"D9"}]
[null,{"$f":"IF($C$9=\"By Rows\",\"F9\",\"E9\")","v":"E9"}]
[null,{"$f":"IF($C$9=\"By Rows\",\"F10\",\"F9\")","v":"F9"}]
[null,{"$f":"IF($C$9=\"By Rows\",\"F11\",\"G9\")","v":"G9"}]
[null,{"$f":"IF($C$9=\"By Rows\",\"F12\",\"H9\")","v":"H9"}]
[null,{"$f":"IF($C$9=\"By Rows\",\"G1\",\"A10\")","v":"A10"}]
[null,{"$f":"IF($C$9=\"By Rows\",\"G2\",\"B10\")","v":"B10"}]
[null,{"$f":"IF($C$9=\"By Rows\",\"G3\",\"C10\")","v":"C10"}]
[null,{"$f":"IF($C$9=\"By Rows\",\"G4\",\"D10\")","v":"D10"}]
[null,{"$f":"IF($C$9=\"By Rows\",\"G5\",\"E10\")","v":"E10"}]
[null,{"$f":"IF($C$9=\"By Rows\",\"G6\",\"F10\")","v":"F10"}]
[null,{"$f":"IF($C$9=\"By Rows\",\"G7\",\"G10\")","v":"G10"}]
[null,{"$f":"IF($C$9=\"By Rows\",\"G8\",\"H10\")","v":"H10"}]
[null,{"$f":"IF($C$9=\"By Rows\",\"G9\",\"A11\")","v":"A11"}]
[null,{"$f":"IF($C$9=\"By Rows\",\"G10\",\"B11\")","v":"B11"}]
[null,{"$f":"IF($C$9=\"By Rows\",\"G11\",\"C11\")","v":"C11"}]
[null,{"$f":"IF($C$9=\"By Rows\",\"G12\",\"D11\")","v":"D11"}]
[null,{"$f":"IF($C$9=\"By Rows\",\"H1\",\"E11\")","v":"E11"}]
[null,{"$f":"IF($C$9=\"By Rows\",\"H2\",\"F11\")","v":"F11"}]
[null,{"$f":"IF($C$9=\"By Rows\",\"H3\",\"G11\")","v":"G11"}]
[null,{"$f":"IF($C$9=\"By Rows\",\"H4\",\"H11\")","v":"H11"}]
[null,{"$f":"IF($C$9=\"By Rows\",\"H5\",\"A12\")","v":"A12"},{"$nulls":6}," "]
[null,{"$f":"IF($C$9=\"By Rows\",\"H6\",\"B12\")","v":"B12"}]
[null,{"$f":"IF($C$9=\"By Rows\",\"H7\",\"C12\")","v":"C12"}]
[null,{"$f":"IF($C$9=\"By Rows\",\"H8\",\"D12\")","v":"D12"}]
[null,{"$f":"IF($C$9=\"By Rows\",\"H9\",\"E12\")","v":"E12"}]
[null,{"$f":"IF($C$9=\"By Rows\",\"H10\",\"F12\")","v":"F12"}]
[null,{"$f":"IF($C$9=\"By Rows\",\"H11\",\"G12\")","v":"G12"}]
[null,"H12"]

{"sheet":"Plate07","index":9,"n_rows":108,"n_cols":9,"rows_kept":108,"cut":false,"hidden":false,"merged":[[4,1,4,2]]}
[]
[null,"ShortSeq Plate (formerly Express Plate)"]
[null,"Upload Form"]
[]
[null,"Plate Information"]
[null,"Plate Barcode:"]
[null,"Sample Type:",null,null,null,"Mandatory"]
[null,{"$f":"IF(C7=\"PCR Products\", \"Product Length:\", \"Construct Size:\")","v":"Construct Size:"},null,null,null,"Optional"]
[null,"Sort Plate:","By Columns"]
[]
[]
[null,"Well Position","Sample Name                              "]
[null,"A1"]
[null,{"$f":"IF($C$9=\"By Rows\",\"A2\",\"B1\")","v":"B1"}]
[null,{"$f":"IF($C$9=\"By Rows\",\"A3\",\"C1\")","v":"C1"}]
[null,{"$f":"IF($C$9=\"By Rows\",\"A4\",\"D1\")","v":"D1"}]
[null,{"$f":"IF($C$9=\"By Rows\",\"A5\",\"E1\")","v":"E1"}]
[null,{"$f":"IF($C$9=\"By Rows\",\"A6\",\"F1\")","v":"F1"}]
[null,{"$f":"IF($C$9=\"By Rows\",\"A7\",\"G1\")","v":"G1"}]
[null,{"$f":"IF($C$9=\"By Rows\",\"A8\",\"H1\")","v":"H1"}]
[null,{"$f":"IF($C$9=\"By Rows\",\"A9\",\"A2\")","v":"A2"}]
[null,{"$f":"IF($C$9=\"By Rows\",\"A10\",\"B2\")","v":"B2"}]
[null,{"$f":"IF($C$9=\"By Rows\",\"A11\",\"C2\")","v":"C2"}]
[null,{"$f":"IF($C$9=\"By Rows\",\"A12\",\"D2\")","v":"D2"}]
[null,{"$f":"IF($C$9=\"By Rows\",\"B1\",\"E2\")","v":"E2"}]
[null,{"$f":"IF($C$9=\"By Rows\",\"B2\",\"F2\")","v":"F2"}]
[null,{"$f":"IF($C$9=\"By Rows\",\"B3\",\"G2\")","v":"G2"}]
[null,{"$f":"IF($C$9=\"By Rows\",\"B4\",\"H2\")","v":"H2"}]
[null,{"$f":"IF($C$9=\"By Rows\",\"B5\",\"A3\")","v":"A3"}]
[null,{"$f":"IF($C$9=\"By Rows\",\"B6\",\"B3\")","v":"B3"}]
[null,{"$f":"IF($C$9=\"By Rows\",\"B7\",\"C3\")","v":"C3"}]
[null,{"$f":"IF($C$9=\"By Rows\",\"B8\",\"D3\")","v":"D3"}]
[null,{"$f":"IF($C$9=\"By Rows\",\"B9\",\"E3\")","v":"E3"}]
[null,{"$f":"IF($C$9=\"By Rows\",\"B10\",\"F3\")","v":"F3"}]
[null,{"$f":"IF($C$9=\"By Rows\",\"B11\",\"G3\")","v":"G3"}]
[null,{"$f":"IF($C$9=\"By Rows\",\"B12\",\"H3\")","v":"H3"}]
[null,{"$f":"IF($C$9=\"By Rows\",\"C1\",\"A4\")","v":"A4"}]
[null,{"$f":"IF($C$9=\"By Rows\",\"C2\",\"B4\")","v":"B4"}]
[null,{"$f":"IF($C$9=\"By Rows\",\"C3\",\"C4\")","v":"C4"}]
[null,{"$f":"IF($C$9=\"By Rows\",\"C4\",\"D4\")","v":"D4"}]
[null,{"$f":"IF($C$9=\"By Rows\",\"C5\",\"E4\")","v":"E4"}]
[null,{"$f":"IF($C$9=\"By Rows\",\"C6\",\"F4\")","v":"F4"}]
[null,{"$f":"IF($C$9=\"By Rows\",\"C7\",\"G4\")","v":"G4"}]
[null,{"$f":"IF($C$9=\"By Rows\",\"C8\",\"H4\")","v":"H4"}]
[null,{"$f":"IF($C$9=\"By Rows\",\"C9\",\"A5\")","v":"A5"}]
[null,{"$f":"IF($C$9=\"By Rows\",\"C10\",\"B5\")","v":"B5"}]
[null,{"$f":"IF($C$9=\"By Rows\",\"C11\",\"C5\")","v":"C5"}]
[null,{"$f":"IF($C$9=\"By Rows\",\"C12\",\"D5\")","v":"D5"}]
[null,{"$f":"IF($C$9=\"By Rows\",\"D1\",\"E5\")","v":"E5"}]
[null,{"$f":"IF($C$9=\"By Rows\",\"D2\",\"F5\")","v":"F5"}]
[null,{"$f":"IF($C$9=\"By Rows\",\"D3\",\"G5\")","v":"G5"}]
[null,{"$f":"IF($C$9=\"By Rows\",\"D4\",\"H5\")","v":"H5"}]
[null,{"$f":"IF($C$9=\"By Rows\",\"D5\",\"A6\")","v":"A6"}]
[null,{"$f":"IF($C$9=\"By Rows\",\"D6\",\"B6\")","v":"B6"}]
[null,{"$f":"IF($C$9=\"By Rows\",\"D7\",\"C6\")","v":"C6"}]
[null,{"$f":"IF($C$9=\"By Rows\",\"D8\",\"D6\")","v":"D6"}]
[null,{"$f":"IF($C$9=\"By Rows\",\"D9\",\"E6\")","v":"E6"}]
[null,{"$f":"IF($C$9=\"By Rows\",\"D10\",\"F6\")","v":"F6"}]
[null,{"$f":"IF($C$9=\"By Rows\",\"D11\",\"G6\")","v":"G6"}]
[null,{"$f":"IF($C$9=\"By Rows\",\"D12\",\"H6\")","v":"H6"}]
[null,{"$f":"IF($C$9=\"By Rows\",\"E1\",\"A7\")","v":"A7"}]
[null,{"$f":"IF($C$9=\"By Rows\",\"E2\",\"B7\")","v":"B7"}]
[null,{"$f":"IF($C$9=\"By Rows\",\"E3\",\"C7\")","v":"C7"}]
[null,{"$f":"IF($C$9=\"By Rows\",\"E4\",\"D7\")","v":"D7"}]
[null,{"$f":"IF($C$9=\"By Rows\",\"E5\",\"E7\")","v":"E7"}]
[null,{"$f":"IF($C$9=\"By Rows\",\"E6\",\"F7\")","v":"F7"}]
[null,{"$f":"IF($C$9=\"By Rows\",\"E7\",\"G7\")","v":"G7"}]
[null,{"$f":"IF($C$9=\"By Rows\",\"E8\",\"H7\")","v":"H7"}]
[null,{"$f":"IF($C$9=\"By Rows\",\"E9\",\"A8\")","v":"A8"}]
[null,{"$f":"IF($C$9=\"By Rows\",\"E10\",\"B8\")","v":"B8"}]
[null,{"$f":"IF($C$9=\"By Rows\",\"E11\",\"C8\")","v":"C8"}]
[null,{"$f":"IF($C$9=\"By Rows\",\"E12\",\"D8\")","v":"D8"}]
[null,{"$f":"IF($C$9=\"By Rows\",\"F1\",\"E8\")","v":"E8"}]
[null,{"$f":"IF($C$9=\"By Rows\",\"F2\",\"F8\")","v":"F8"}]
[null,{"$f":"IF($C$9=\"By Rows\",\"F3\",\"G8\")","v":"G8"}]
[null,{"$f":"IF($C$9=\"By Rows\",\"F4\",\"H8\")","v":"H8"}]
[null,{"$f":"IF($C$9=\"By Rows\",\"F5\",\"A9\")","v":"A9"}]
[null,{"$f":"IF($C$9=\"By Rows\",\"F6\",\"B9\")","v":"B9"}]
[null,{"$f":"IF($C$9=\"By Rows\",\"F7\",\"C9\")","v":"C9"}]
[null,{"$f":"IF($C$9=\"By Rows\",\"F8\",\"D9\")","v":"D9"}]
[null,{"$f":"IF($C$9=\"By Rows\",\"F9\",\"E9\")","v":"E9"}]
[null,{"$f":"IF($C$9=\"By Rows\",\"F10\",\"F9\")","v":"F9"}]
[null,{"$f":"IF($C$9=\"By Rows\",\"F11\",\"G9\")","v":"G9"}]
[null,{"$f":"IF($C$9=\"By Rows\",\"F12\",\"H9\")","v":"H9"}]
[null,{"$f":"IF($C$9=\"By Rows\",\"G1\",\"A10\")","v":"A10"}]
[null,{"$f":"IF($C$9=\"By Rows\",\"G2\",\"B10\")","v":"B10"}]
[null,{"$f":"IF($C$9=\"By Rows\",\"G3\",\"C10\")","v":"C10"}]
[null,{"$f":"IF($C$9=\"By Rows\",\"G4\",\"D10\")","v":"D10"}]
[null,{"$f":"IF($C$9=\"By Rows\",\"G5\",\"E10\")","v":"E10"}]
[null,{"$f":"IF($C$9=\"By Rows\",\"G6\",\"F10\")","v":"F10"}]
[null,{"$f":"IF($C$9=\"By Rows\",\"G7\",\"G10\")","v":"G10"}]
[null,{"$f":"IF($C$9=\"By Rows\",\"G8\",\"H10\")","v":"H10"}]
[null,{"$f":"IF($C$9=\"By Rows\",\"G9\",\"A11\")","v":"A11"}]
[null,{"$f":"IF($C$9=\"By Rows\",\"G10\",\"B11\")","v":"B11"}]
[null,{"$f":"IF($C$9=\"By Rows\",\"G11\",\"C11\")","v":"C11"}]
[null,{"$f":"IF($C$9=\"By Rows\",\"G12\",\"D11\")","v":"D11"}]
[null,{"$f":"IF($C$9=\"By Rows\",\"H1\",\"E11\")","v":"E11"}]
[null,{"$f":"IF($C$9=\"By Rows\",\"H2\",\"F11\")","v":"F11"}]
[null,{"$f":"IF($C$9=\"By Rows\",\"H3\",\"G11\")","v":"G11"}]
[null,{"$f":"IF($C$9=\"By Rows\",\"H4\",\"H11\")","v":"H11"}]
[null,{"$f":"IF($C$9=\"By Rows\",\"H5\",\"A12\")","v":"A12"},{"$nulls":6}," "]
[null,{"$f":"IF($C$9=\"By Rows\",\"H6\",\"B12\")","v":"B12"}]
[null,{"$f":"IF($C$9=\"By Rows\",\"H7\",\"C12\")","v":"C12"}]
[null,{"$f":"IF($C$9=\"By Rows\",\"H8\",\"D12\")","v":"D12"}]
[null,{"$f":"IF($C$9=\"By Rows\",\"H9\",\"E12\")","v":"E12"}]
[null,{"$f":"IF($C$9=\"By Rows\",\"H10\",\"F12\")","v":"F12"}]
[null,{"$f":"IF($C$9=\"By Rows\",\"H11\",\"G12\")","v":"G12"}]
[null,"H12"]

{"sheet":"Plate08","index":10,"n_rows":108,"n_cols":9,"rows_kept":108,"cut":false,"hidden":false,"merged":[[4,1,4,2]]}
[]
[null,"ShortSeq Plate (formerly Express Plate)"]
[null,"Upload Form"]
[]
[null,"Plate Information"]
[null,"Plate Barcode:"]
[null,"Sample Type:",null,null,null,"Mandatory"]
[null,{"$f":"IF(C7=\"PCR Products\", \"Product Length:\", \"Construct Size:\")","v":"Construct Size:"},null,null,null,"Optional"]
[null,"Sort Plate:","By Columns"]
[]
[]
[null,"Well Position","Sample Name                              "]
[null,"A1"]
[null,{"$f":"IF($C$9=\"By Rows\",\"A2\",\"B1\")","v":"B1"}]
[null,{"$f":"IF($C$9=\"By Rows\",\"A3\",\"C1\")","v":"C1"}]
[null,{"$f":"IF($C$9=\"By Rows\",\"A4\",\"D1\")","v":"D1"}]
[null,{"$f":"IF($C$9=\"By Rows\",\"A5\",\"E1\")","v":"E1"}]
[null,{"$f":"IF($C$9=\"By Rows\",\"A6\",\"F1\")","v":"F1"}]
[null,{"$f":"IF($C$9=\"By Rows\",\"A7\",\"G1\")","v":"G1"}]
[null,{"$f":"IF($C$9=\"By Rows\",\"A8\",\"H1\")","v":"H1"}]
[null,{"$f":"IF($C$9=\"By Rows\",\"A9\",\"A2\")","v":"A2"}]
[null,{"$f":"IF($C$9=\"By Rows\",\"A10\",\"B2\")","v":"B2"}]
[null,{"$f":"IF($C$9=\"By Rows\",\"A11\",\"C2\")","v":"C2"}]
[null,{"$f":"IF($C$9=\"By Rows\",\"A12\",\"D2\")","v":"D2"}]
[null,{"$f":"IF($C$9=\"By Rows\",\"B1\",\"E2\")","v":"E2"}]
[null,{"$f":"IF($C$9=\"By Rows\",\"B2\",\"F2\")","v":"F2"}]
[null,{"$f":"IF($C$9=\"By Rows\",\"B3\",\"G2\")","v":"G2"}]
[null,{"$f":"IF($C$9=\"By Rows\",\"B4\",\"H2\")","v":"H2"}]
[null,{"$f":"IF($C$9=\"By Rows\",\"B5\",\"A3\")","v":"A3"}]
[null,{"$f":"IF($C$9=\"By Rows\",\"B6\",\"B3\")","v":"B3"}]
[null,{"$f":"IF($C$9=\"By Rows\",\"B7\",\"C3\")","v":"C3"}]
[null,{"$f":"IF($C$9=\"By Rows\",\"B8\",\"D3\")","v":"D3"}]
[null,{"$f":"IF($C$9=\"By Rows\",\"B9\",\"E3\")","v":"E3"}]
[null,{"$f":"IF($C$9=\"By Rows\",\"B10\",\"F3\")","v":"F3"}]
[null,{"$f":"IF($C$9=\"By Rows\",\"B11\",\"G3\")","v":"G3"}]
[null,{"$f":"IF($C$9=\"By Rows\",\"B12\",\"H3\")","v":"H3"}]
[null,{"$f":"IF($C$9=\"By Rows\",\"C1\",\"A4\")","v":"A4"}]
[null,{"$f":"IF($C$9=\"By Rows\",\"C2\",\"B4\")","v":"B4"}]
[null,{"$f":"IF($C$9=\"By Rows\",\"C3\",\"C4\")","v":"C4"}]
[null,{"$f":"IF($C$9=\"By Rows\",\"C4\",\"D4\")","v":"D4"}]
[null,{"$f":"IF($C$9=\"By Rows\",\"C5\",\"E4\")","v":"E4"}]
[null,{"$f":"IF($C$9=\"By Rows\",\"C6\",\"F4\")","v":"F4"}]
[null,{"$f":"IF($C$9=\"By Rows\",\"C7\",\"G4\")","v":"G4"}]
[null,{"$f":"IF($C$9=\"By Rows\",\"C8\",\"H4\")","v":"H4"}]
[null,{"$f":"IF($C$9=\"By Rows\",\"C9\",\"A5\")","v":"A5"}]
[null,{"$f":"IF($C$9=\"By Rows\",\"C10\",\"B5\")","v":"B5"}]
[null,{"$f":"IF($C$9=\"By Rows\",\"C11\",\"C5\")","v":"C5"}]
[null,{"$f":"IF($C$9=\"By Rows\",\"C12\",\"D5\")","v":"D5"}]
[null,{"$f":"IF($C$9=\"By Rows\",\"D1\",\"E5\")","v":"E5"}]
[null,{"$f":"IF($C$9=\"By Rows\",\"D2\",\"F5\")","v":"F5"}]
[null,{"$f":"IF($C$9=\"By Rows\",\"D3\",\"G5\")","v":"G5"}]
[null,{"$f":"IF($C$9=\"By Rows\",\"D4\",\"H5\")","v":"H5"}]
[null,{"$f":"IF($C$9=\"By Rows\",\"D5\",\"A6\")","v":"A6"}]
[null,{"$f":"IF($C$9=\"By Rows\",\"D6\",\"B6\")","v":"B6"}]
[null,{"$f":"IF($C$9=\"By Rows\",\"D7\",\"C6\")","v":"C6"}]
[null,{"$f":"IF($C$9=\"By Rows\",\"D8\",\"D6\")","v":"D6"}]
[null,{"$f":"IF($C$9=\"By Rows\",\"D9\",\"E6\")","v":"E6"}]
[null,{"$f":"IF($C$9=\"By Rows\",\"D10\",\"F6\")","v":"F6"}]
[null,{"$f":"IF($C$9=\"By Rows\",\"D11\",\"G6\")","v":"G6"}]
[null,{"$f":"IF($C$9=\"By Rows\",\"D12\",\"H6\")","v":"H6"}]
[null,{"$f":"IF($C$9=\"By Rows\",\"E1\",\"A7\")","v":"A7"}]
[null,{"$f":"IF($C$9=\"By Rows\",\"E2\",\"B7\")","v":"B7"}]
[null,{"$f":"IF($C$9=\"By Rows\",\"E3\",\"C7\")","v":"C7"}]
[null,{"$f":"IF($C$9=\"By Rows\",\"E4\",\"D7\")","v":"D7"}]
[null,{"$f":"IF($C$9=\"By Rows\",\"E5\",\"E7\")","v":"E7"}]
[null,{"$f":"IF($C$9=\"By Rows\",\"E6\",\"F7\")","v":"F7"}]
[null,{"$f":"IF($C$9=\"By Rows\",\"E7\",\"G7\")","v":"G7"}]
[null,{"$f":"IF($C$9=\"By Rows\",\"E8\",\"H7\")","v":"H7"}]
[null,{"$f":"IF($C$9=\"By Rows\",\"E9\",\"A8\")","v":"A8"}]
[null,{"$f":"IF($C$9=\"By Rows\",\"E10\",\"B8\")","v":"B8"}]
[null,{"$f":"IF($C$9=\"By Rows\",\"E11\",\"C8\")","v":"C8"}]
[null,{"$f":"IF($C$9=\"By Rows\",\"E12\",\"D8\")","v":"D8"}]
[null,{"$f":"IF($C$9=\"By Rows\",\"F1\",\"E8\")","v":"E8"}]
[null,{"$f":"IF($C$9=\"By Rows\",\"F2\",\"F8\")","v":"F8"}]
[null,{"$f":"IF($C$9=\"By Rows\",\"F3\",\"G8\")","v":"G8"}]
[null,{"$f":"IF($C$9=\"By Rows\",\"F4\",\"H8\")","v":"H8"}]
[null,{"$f":"IF($C$9=\"By Rows\",\"F5\",\"A9\")","v":"A9"}]
[null,{"$f":"IF($C$9=\"By Rows\",\"F6\",\"B9\")","v":"B9"}]
[null,{"$f":"IF($C$9=\"By Rows\",\"F7\",\"C9\")","v":"C9"}]
[null,{"$f":"IF($C$9=\"By Rows\",\"F8\",\"D9\")","v":"D9"}]
[null,{"$f":"IF($C$9=\"By Rows\",\"F9\",\"E9\")","v":"E9"}]
[null,{"$f":"IF($C$9=\"By Rows\",\"F10\",\"F9\")","v":"F9"}]
[null,{"$f":"IF($C$9=\"By Rows\",\"F11\",\"G9\")","v":"G9"}]
[null,{"$f":"IF($C$9=\"By Rows\",\"F12\",\"H9\")","v":"H9"}]
[null,{"$f":"IF($C$9=\"By Rows\",\"G1\",\"A10\")","v":"A10"}]
[null,{"$f":"IF($C$9=\"By Rows\",\"G2\",\"B10\")","v":"B10"}]
[null,{"$f":"IF($C$9=\"By Rows\",\"G3\",\"C10\")","v":"C10"}]
[null,{"$f":"IF($C$9=\"By Rows\",\"G4\",\"D10\")","v":"D10"}]
[null,{"$f":"IF($C$9=\"By Rows\",\"G5\",\"E10\")","v":"E10"}]
[null,{"$f":"IF($C$9=\"By Rows\",\"G6\",\"F10\")","v":"F10"}]
[null,{"$f":"IF($C$9=\"By Rows\",\"G7\",\"G10\")","v":"G10"}]
[null,{"$f":"IF($C$9=\"By Rows\",\"G8\",\"H10\")","v":"H10"}]
[null,{"$f":"IF($C$9=\"By Rows\",\"G9\",\"A11\")","v":"A11"}]
[null,{"$f":"IF($C$9=\"By Rows\",\"G10\",\"B11\")","v":"B11"}]
[null,{"$f":"IF($C$9=\"By Rows\",\"G11\",\"C11\")","v":"C11"}]
[null,{"$f":"IF($C$9=\"By Rows\",\"G12\",\"D11\")","v":"D11"}]
[null,{"$f":"IF($C$9=\"By Rows\",\"H1\",\"E11\")","v":"E11"}]
[null,{"$f":"IF($C$9=\"By Rows\",\"H2\",\"F11\")","v":"F11"}]
[null,{"$f":"IF($C$9=\"By Rows\",\"H3\",\"G11\")","v":"G11"}]
[null,{"$f":"IF($C$9=\"By Rows\",\"H4\",\"H11\")","v":"H11"}]
[null,{"$f":"IF($C$9=\"By Rows\",\"H5\",\"A12\")","v":"A12"},{"$nulls":6}," "]
[null,{"$f":"IF($C$9=\"By Rows\",\"H6\",\"B12\")","v":"B12"}]
[null,{"$f":"IF($C$9=\"By Rows\",\"H7\",\"C12\")","v":"C12"}]
[null,{"$f":"IF($C$9=\"By Rows\",\"H8\",\"D12\")","v":"D12"}]
[null,{"$f":"IF($C$9=\"By Rows\",\"H9\",\"E12\")","v":"E12"}]
[null,{"$f":"IF($C$9=\"By Rows\",\"H10\",\"F12\")","v":"F12"}]
[null,{"$f":"IF($C$9=\"By Rows\",\"H11\",\"G12\")","v":"G12"}]
[null,"H12"]

{"sheet":"Plate09","index":11,"n_rows":108,"n_cols":9,"rows_kept":108,"cut":false,"hidden":false,"merged":[[4,1,4,2]]}
[]
[null,"ShortSeq Plate (formerly Express Plate)"]
[null,"Upload Form"]
[]
[null,"Plate Information"]
[null,"Plate Barcode:"]
[null,"Sample Type:",null,null,null,"Mandatory"]
[null,{"$f":"IF(C7=\"PCR Products\", \"Product Length:\", \"Construct Size:\")","v":"Construct Size:"},null,null,null,"Optional"]
[null,"Sort Plate:","By Columns"]
[]
[]
[null,"Well Position","Sample Name                              "]
[null,"A1"]
[null,{"$f":"IF($C$9=\"By Rows\",\"A2\",\"B1\")","v":"B1"}]
[null,{"$f":"IF($C$9=\"By Rows\",\"A3\",\"C1\")","v":"C1"}]
[null,{"$f":"IF($C$9=\"By Rows\",\"A4\",\"D1\")","v":"D1"}]
[null,{"$f":"IF($C$9=\"By Rows\",\"A5\",\"E1\")","v":"E1"}]
[null,{"$f":"IF($C$9=\"By Rows\",\"A6\",\"F1\")","v":"F1"}]
[null,{"$f":"IF($C$9=\"By Rows\",\"A7\",\"G1\")","v":"G1"}]
[null,{"$f":"IF($C$9=\"By Rows\",\"A8\",\"H1\")","v":"H1"}]
[null,{"$f":"IF($C$9=\"By Rows\",\"A9\",\"A2\")","v":"A2"}]
[null,{"$f":"IF($C$9=\"By Rows\",\"A10\",\"B2\")","v":"B2"}]
[null,{"$f":"IF($C$9=\"By Rows\",\"A11\",\"C2\")","v":"C2"}]
[null,{"$f":"IF($C$9=\"By Rows\",\"A12\",\"D2\")","v":"D2"}]
[null,{"$f":"IF($C$9=\"By Rows\",\"B1\",\"E2\")","v":"E2"}]
[null,{"$f":"IF($C$9=\"By Rows\",\"B2\",\"F2\")","v":"F2"}]
[null,{"$f":"IF($C$9=\"By Rows\",\"B3\",\"G2\")","v":"G2"}]
[null,{"$f":"IF($C$9=\"By Rows\",\"B4\",\"H2\")","v":"H2"}]
[null,{"$f":"IF($C$9=\"By Rows\",\"B5\",\"A3\")","v":"A3"}]
[null,{"$f":"IF($C$9=\"By Rows\",\"B6\",\"B3\")","v":"B3"}]
[null,{"$f":"IF($C$9=\"By Rows\",\"B7\",\"C3\")","v":"C3"}]
[null,{"$f":"IF($C$9=\"By Rows\",\"B8\",\"D3\")","v":"D3"}]
[null,{"$f":"IF($C$9=\"By Rows\",\"B9\",\"E3\")","v":"E3"}]
[null,{"$f":"IF($C$9=\"By Rows\",\"B10\",\"F3\")","v":"F3"}]
[null,{"$f":"IF($C$9=\"By Rows\",\"B11\",\"G3\")","v":"G3"}]
[null,{"$f":"IF($C$9=\"By Rows\",\"B12\",\"H3\")","v":"H3"}]
[null,{"$f":"IF($C$9=\"By Rows\",\"C1\",\"A4\")","v":"A4"}]
[null,{"$f":"IF($C$9=\"By Rows\",\"C2\",\"B4\")","v":"B4"}]
[null,{"$f":"IF($C$9=\"By Rows\",\"C3\",\"C4\")","v":"C4"}]
[null,{"$f":"IF($C$9=\"By Rows\",\"C4\",\"D4\")","v":"D4"}]
[null,{"$f":"IF($C$9=\"By Rows\",\"C5\",\"E4\")","v":"E4"}]
[null,{"$f":"IF($C$9=\"By Rows\",\"C6\",\"F4\")","v":"F4"}]
[null,{"$f":"IF($C$9=\"By Rows\",\"C7\",\"G4\")","v":"G4"}]
[null,{"$f":"IF($C$9=\"By Rows\",\"C8\",\"H4\")","v":"H4"}]
[null,{"$f":"IF($C$9=\"By Rows\",\"C9\",\"A5\")","v":"A5"}]
[null,{"$f":"IF($C$9=\"By Rows\",\"C10\",\"B5\")","v":"B5"}]
[null,{"$f":"IF($C$9=\"By Rows\",\"C11\",\"C5\")","v":"C5"}]
[null,{"$f":"IF($C$9=\"By Rows\",\"C12\",\"D5\")","v":"D5"}]
[null,{"$f":"IF($C$9=\"By Rows\",\"D1\",\"E5\")","v":"E5"}]
[null,{"$f":"IF($C$9=\"By Rows\",\"D2\",\"F5\")","v":"F5"}]
[null,{"$f":"IF($C$9=\"By Rows\",\"D3\",\"G5\")","v":"G5"}]
[null,{"$f":"IF($C$9=\"By Rows\",\"D4\",\"H5\")","v":"H5"}]
[null,{"$f":"IF($C$9=\"By Rows\",\"D5\",\"A6\")","v":"A6"}]
[null,{"$f":"IF($C$9=\"By Rows\",\"D6\",\"B6\")","v":"B6"}]
[null,{"$f":"IF($C$9=\"By Rows\",\"D7\",\"C6\")","v":"C6"}]
[null,{"$f":"IF($C$9=\"By Rows\",\"D8\",\"D6\")","v":"D6"}]
[null,{"$f":"IF($C$9=\"By Rows\",\"D9\",\"E6\")","v":"E6"}]
[null,{"$f":"IF($C$9=\"By Rows\",\"D10\",\"F6\")","v":"F6"}]
[null,{"$f":"IF($C$9=\"By Rows\",\"D11\",\"G6\")","v":"G6"}]
[null,{"$f":"IF($C$9=\"By Rows\",\"D12\",\"H6\")","v":"H6"}]
[null,{"$f":"IF($C$9=\"By Rows\",\"E1\",\"A7\")","v":"A7"}]
[null,{"$f":"IF($C$9=\"By Rows\",\"E2\",\"B7\")","v":"B7"}]
[null,{"$f":"IF($C$9=\"By Rows\",\"E3\",\"C7\")","v":"C7"}]
[null,{"$f":"IF($C$9=\"By Rows\",\"E4\",\"D7\")","v":"D7"}]
[null,{"$f":"IF($C$9=\"By Rows\",\"E5\",\"E7\")","v":"E7"}]
[null,{"$f":"IF($C$9=\"By Rows\",\"E6\",\"F7\")","v":"F7"}]
[null,{"$f":"IF($C$9=\"By Rows\",\"E7\",\"G7\")","v":"G7"}]
[null,{"$f":"IF($C$9=\"By Rows\",\"E8\",\"H7\")","v":"H7"}]
[null,{"$f":"IF($C$9=\"By Rows\",\"E9\",\"A8\")","v":"A8"}]
[null,{"$f":"IF($C$9=\"By Rows\",\"E10\",\"B8\")","v":"B8"}]
[null,{"$f":"IF($C$9=\"By Rows\",\"E11\",\"C8\")","v":"C8"}]
[null,{"$f":"IF($C$9=\"By Rows\",\"E12\",\"D8\")","v":"D8"}]
[null,{"$f":"IF($C$9=\"By Rows\",\"F1\",\"E8\")","v":"E8"}]
[null,{"$f":"IF($C$9=\"By Rows\",\"F2\",\"F8\")","v":"F8"}]
[null,{"$f":"IF($C$9=\"By Rows\",\"F3\",\"G8\")","v":"G8"}]
[null,{"$f":"IF($C$9=\"By Rows\",\"F4\",\"H8\")","v":"H8"}]
[null,{"$f":"IF($C$9=\"By Rows\",\"F5\",\"A9\")","v":"A9"}]
[null,{"$f":"IF($C$9=\"By Rows\",\"F6\",\"B9\")","v":"B9"}]
[null,{"$f":"IF($C$9=\"By Rows\",\"F7\",\"C9\")","v":"C9"}]
[null,{"$f":"IF($C$9=\"By Rows\",\"F8\",\"D9\")","v":"D9"}]
[null,{"$f":"IF($C$9=\"By Rows\",\"F9\",\"E9\")","v":"E9"}]
[null,{"$f":"IF($C$9=\"By Rows\",\"F10\",\"F9\")","v":"F9"}]
[null,{"$f":"IF($C$9=\"By Rows\",\"F11\",\"G9\")","v":"G9"}]
[null,{"$f":"IF($C$9=\"By Rows\",\"F12\",\"H9\")","v":"H9"}]
[null,{"$f":"IF($C$9=\"By Rows\",\"G1\",\"A10\")","v":"A10"}]
[null,{"$f":"IF($C$9=\"By Rows\",\"G2\",\"B10\")","v":"B10"}]
[null,{"$f":"IF($C$9=\"By Rows\",\"G3\",\"C10\")","v":"C10"}]
[null,{"$f":"IF($C$9=\"By Rows\",\"G4\",\"D10\")","v":"D10"}]
[null,{"$f":"IF($C$9=\"By Rows\",\"G5\",\"E10\")","v":"E10"}]
[null,{"$f":"IF($C$9=\"By Rows\",\"G6\",\"F10\")","v":"F10"}]
[null,{"$f":"IF($C$9=\"By Rows\",\"G7\",\"G10\")","v":"G10"}]
[null,{"$f":"IF($C$9=\"By Rows\",\"G8\",\"H10\")","v":"H10"}]
[null,{"$f":"IF($C$9=\"By Rows\",\"G9\",\"A11\")","v":"A11"}]
[null,{"$f":"IF($C$9=\"By Rows\",\"G10\",\"B11\")","v":"B11"}]
[null,{"$f":"IF($C$9=\"By Rows\",\"G11\",\"C11\")","v":"C11"}]
[null,{"$f":"IF($C$9=\"By Rows\",\"G12\",\"D11\")","v":"D11"}]
[null,{"$f":"IF($C$9=\"By Rows\",\"H1\",\"E11\")","v":"E11"}]
[null,{"$f":"IF($C$9=\"By Rows\",\"H2\",\"F11\")","v":"F11"}]
[null,{"$f":"IF($C$9=\"By Rows\",\"H3\",\"G11\")","v":"G11"}]
[null,{"$f":"IF($C$9=\"By Rows\",\"H4\",\"H11\")","v":"H11"}]
[null,{"$f":"IF($C$9=\"By Rows\",\"H5\",\"A12\")","v":"A12"},{"$nulls":6}," "]
[null,{"$f":"IF($C$9=\"By Rows\",\"H6\",\"B12\")","v":"B12"}]
[null,{"$f":"IF($C$9=\"By Rows\",\"H7\",\"C12\")","v":"C12"}]
[null,{"$f":"IF($C$9=\"By Rows\",\"H8\",\"D12\")","v":"D12"}]
[null,{"$f":"IF($C$9=\"By Rows\",\"H9\",\"E12\")","v":"E12"}]
[null,{"$f":"IF($C$9=\"By Rows\",\"H10\",\"F12\")","v":"F12"}]
[null,{"$f":"IF($C$9=\"By Rows\",\"H11\",\"G12\")","v":"G12"}]
[null,"H12"]

{"sheet":"Plate10","index":12,"n_rows":108,"n_cols":9,"rows_kept":108,"cut":false,"hidden":false,"merged":[[4,1,4,2]]}
[]
[null,"ShortSeq Plate (formerly Express Plate)"]
[null,"Upload Form"]
[]
[null,"Plate Information"]
[null,"Plate Barcode:"]
[null,"Sample Type:",null,null,null,"Mandatory"]
[null,{"$f":"IF(C7=\"PCR Products\", \"Product Length:\", \"Construct Size:\")","v":"Construct Size:"},null,null,null,"Optional"]
[null,"Sort Plate:","By Columns"]
[]
[]
[null,"Well Position","Sample Name                              "]
[null,"A1"]
[null,{"$f":"IF($C$9=\"By Rows\",\"A2\",\"B1\")","v":"B1"}]
[null,{"$f":"IF($C$9=\"By Rows\",\"A3\",\"C1\")","v":"C1"}]
[null,{"$f":"IF($C$9=\"By Rows\",\"A4\",\"D1\")","v":"D1"}]
[null,{"$f":"IF($C$9=\"By Rows\",\"A5\",\"E1\")","v":"E1"}]
[null,{"$f":"IF($C$9=\"By Rows\",\"A6\",\"F1\")","v":"F1"}]
[null,{"$f":"IF($C$9=\"By Rows\",\"A7\",\"G1\")","v":"G1"}]
[null,{"$f":"IF($C$9=\"By Rows\",\"A8\",\"H1\")","v":"H1"}]
[null,{"$f":"IF($C$9=\"By Rows\",\"A9\",\"A2\")","v":"A2"}]
[null,{"$f":"IF($C$9=\"By Rows\",\"A10\",\"B2\")","v":"B2"}]
[null,{"$f":"IF($C$9=\"By Rows\",\"A11\",\"C2\")","v":"C2"}]
[null,{"$f":"IF($C$9=\"By Rows\",\"A12\",\"D2\")","v":"D2"}]
[null,{"$f":"IF($C$9=\"By Rows\",\"B1\",\"E2\")","v":"E2"}]
[null,{"$f":"IF($C$9=\"By Rows\",\"B2\",\"F2\")","v":"F2"}]
[null,{"$f":"IF($C$9=\"By Rows\",\"B3\",\"G2\")","v":"G2"}]
[null,{"$f":"IF($C$9=\"By Rows\",\"B4\",\"H2\")","v":"H2"}]
[null,{"$f":"IF($C$9=\"By Rows\",\"B5\",\"A3\")","v":"A3"}]
[null,{"$f":"IF($C$9=\"By Rows\",\"B6\",\"B3\")","v":"B3"}]
[null,{"$f":"IF($C$9=\"By Rows\",\"B7\",\"C3\")","v":"C3"}]
[null,{"$f":"IF($C$9=\"By Rows\",\"B8\",\"D3\")","v":"D3"}]
[null,{"$f":"IF($C$9=\"By Rows\",\"B9\",\"E3\")","v":"E3"}]
[null,{"$f":"IF($C$9=\"By Rows\",\"B10\",\"F3\")","v":"F3"}]
[null,{"$f":"IF($C$9=\"By Rows\",\"B11\",\"G3\")","v":"G3"}]
[null,{"$f":"IF($C$9=\"By Rows\",\"B12\",\"H3\")","v":"H3"}]
[null,{"$f":"IF($C$9=\"By Rows\",\"C1\",\"A4\")","v":"A4"}]
[null,{"$f":"IF($C$9=\"By Rows\",\"C2\",\"B4\")","v":"B4"}]
[null,{"$f":"IF($C$9=\"By Rows\",\"C3\",\"C4\")","v":"C4"}]
[null,{"$f":"IF($C$9=\"By Rows\",\"C4\",\"D4\")","v":"D4"}]
[null,{"$f":"IF($C$9=\"By Rows\",\"C5\",\"E4\")","v":"E4"}]
[null,{"$f":"IF($C$9=\"By Rows\",\"C6\",\"F4\")","v":"F4"}]
[null,{"$f":"IF($C$9=\"By Rows\",\"C7\",\"G4\")","v":"G4"}]
[null,{"$f":"IF($C$9=\"By Rows\",\"C8\",\"H4\")","v":"H4"}]
[null,{"$f":"IF($C$9=\"By Rows\",\"C9\",\"A5\")","v":"A5"}]
[null,{"$f":"IF($C$9=\"By Rows\",\"C10\",\"B5\")","v":"B5"}]
[null,{"$f":"IF($C$9=\"By Rows\",\"C11\",\"C5\")","v":"C5"}]
[null,{"$f":"IF($C$9=\"By Rows\",\"C12\",\"D5\")","v":"D5"}]
[null,{"$f":"IF($C$9=\"By Rows\",\"D1\",\"E5\")","v":"E5"}]
[null,{"$f":"IF($C$9=\"By Rows\",\"D2\",\"F5\")","v":"F5"}]
[null,{"$f":"IF($C$9=\"By Rows\",\"D3\",\"G5\")","v":"G5"}]
[null,{"$f":"IF($C$9=\"By Rows\",\"D4\",\"H5\")","v":"H5"}]
[null,{"$f":"IF($C$9=\"By Rows\",\"D5\",\"A6\")","v":"A6"}]
[null,{"$f":"IF($C$9=\"By Rows\",\"D6\",\"B6\")","v":"B6"}]
[null,{"$f":"IF($C$9=\"By Rows\",\"D7\",\"C6\")","v":"C6"}]
[null,{"$f":"IF($C$9=\"By Rows\",\"D8\",\"D6\")","v":"D6"}]
[null,{"$f":"IF($C$9=\"By Rows\",\"D9\",\"E6\")","v":"E6"}]
[null,{"$f":"IF($C$9=\"By Rows\",\"D10\",\"F6\")","v":"F6"}]
[null,{"$f":"IF($C$9=\"By Rows\",\"D11\",\"G6\")","v":"G6"}]
[null,{"$f":"IF($C$9=\"By Rows\",\"D12\",\"H6\")","v":"H6"}]
[null,{"$f":"IF($C$9=\"By Rows\",\"E1\",\"A7\")","v":"A7"}]
[null,{"$f":"IF($C$9=\"By Rows\",\"E2\",\"B7\")","v":"B7"}]
[null,{"$f":"IF($C$9=\"By Rows\",\"E3\",\"C7\")","v":"C7"}]
[null,{"$f":"IF($C$9=\"By Rows\",\"E4\",\"D7\")","v":"D7"}]
[null,{"$f":"IF($C$9=\"By Rows\",\"E5\",\"E7\")","v":"E7"}]
[null,{"$f":"IF($C$9=\"By Rows\",\"E6\",\"F7\")","v":"F7"}]
[null,{"$f":"IF($C$9=\"By Rows\",\"E7\",\"G7\")","v":"G7"}]
[null,{"$f":"IF($C$9=\"By Rows\",\"E8\",\"H7\")","v":"H7"}]
[null,{"$f":"IF($C$9=\"By Rows\",\"E9\",\"A8\")","v":"A8"}]
[null,{"$f":"IF($C$9=\"By Rows\",\"E10\",\"B8\")","v":"B8"}]
[null,{"$f":"IF($C$9=\"By Rows\",\"E11\",\"C8\")","v":"C8"}]
[null,{"$f":"IF($C$9=\"By Rows\",\"E12\",\"D8\")","v":"D8"}]
[null,{"$f":"IF($C$9=\"By Rows\",\"F1\",\"E8\")","v":"E8"}]
[null,{"$f":"IF($C$9=\"By Rows\",\"F2\",\"F8\")","v":"F8"}]
[null,{"$f":"IF($C$9=\"By Rows\",\"F3\",\"G8\")","v":"G8"}]
[null,{"$f":"IF($C$9=\"By Rows\",\"F4\",\"H8\")","v":"H8"}]
[null,{"$f":"IF($C$9=\"By Rows\",\"F5\",\"A9\")","v":"A9"}]
[null,{"$f":"IF($C$9=\"By Rows\",\"F6\",\"B9\")","v":"B9"}]
[null,{"$f":"IF($C$9=\"By Rows\",\"F7\",\"C9\")","v":"C9"}]
[null,{"$f":"IF($C$9=\"By Rows\",\"F8\",\"D9\")","v":"D9"}]
[null,{"$f":"IF($C$9=\"By Rows\",\"F9\",\"E9\")","v":"E9"}]
[null,{"$f":"IF($C$9=\"By Rows\",\"F10\",\"F9\")","v":"F9"}]
[null,{"$f":"IF($C$9=\"By Rows\",\"F11\",\"G9\")","v":"G9"}]
[null,{"$f":"IF($C$9=\"By Rows\",\"F12\",\"H9\")","v":"H9"}]
[null,{"$f":"IF($C$9=\"By Rows\",\"G1\",\"A10\")","v":"A10"}]
[null,{"$f":"IF($C$9=\"By Rows\",\"G2\",\"B10\")","v":"B10"}]
[null,{"$f":"IF($C$9=\"By Rows\",\"G3\",\"C10\")","v":"C10"}]
[null,{"$f":"IF($C$9=\"By Rows\",\"G4\",\"D10\")","v":"D10"}]
[null,{"$f":"IF($C$9=\"By Rows\",\"G5\",\"E10\")","v":"E10"}]
[null,{"$f":"IF($C$9=\"By Rows\",\"G6\",\"F10\")","v":"F10"}]
[null,{"$f":"IF($C$9=\"By Rows\",\"G7\",\"G10\")","v":"G10"}]
[null,{"$f":"IF($C$9=\"By Rows\",\"G8\",\"H10\")","v":"H10"}]
[null,{"$f":"IF($C$9=\"By Rows\",\"G9\",\"A11\")","v":"A11"}]
[null,{"$f":"IF($C$9=\"By Rows\",\"G10\",\"B11\")","v":"B11"}]
[null,{"$f":"IF($C$9=\"By Rows\",\"G11\",\"C11\")","v":"C11"}]
[null,{"$f":"IF($C$9=\"By Rows\",\"G12\",\"D11\")","v":"D11"}]
[null,{"$f":"IF($C$9=\"By Rows\",\"H1\",\"E11\")","v":"E11"}]
[null,{"$f":"IF($C$9=\"By Rows\",\"H2\",\"F11\")","v":"F11"}]
[null,{"$f":"IF($C$9=\"By Rows\",\"H3\",\"G11\")","v":"G11"}]
[null,{"$f":"IF($C$9=\"By Rows\",\"H4\",\"H11\")","v":"H11"}]
[null,{"$f":"IF($C$9=\"By Rows\",\"H5\",\"A12\")","v":"A12"},{"$nulls":6}," "]
[null,{"$f":"IF($C$9=\"By Rows\",\"H6\",\"B12\")","v":"B12"}]
[null,{"$f":"IF($C$9=\"By Rows\",\"H7\",\"C12\")","v":"C12"}]
[null,{"$f":"IF($C$9=\"By Rows\",\"H8\",\"D12\")","v":"D12"}]
[null,{"$f":"IF($C$9=\"By Rows\",\"H9\",\"E12\")","v":"E12"}]
[null,{"$f":"IF($C$9=\"By Rows\",\"H10\",\"F12\")","v":"F12"}]
[null,{"$f":"IF($C$9=\"By Rows\",\"H11\",\"G12\")","v":"G12"}]
[null,"H12"]

{"sheet":"Plate11","index":13,"n_rows":108,"n_cols":9,"rows_kept":108,"cut":false,"hidden":false,"merged":[[4,1,4,2]]}
[]
[null,"ShortSeq Plate (formerly Express Plate)"]
[null,"Upload Form"]
[]
[null,"Plate Information"]
[null,"Plate Barcode:"]
[null,"Sample Type:",null,null,null,"Mandatory"]
[null,{"$f":"IF(C7=\"PCR Products\", \"Product Length:\", \"Construct Size:\")","v":"Construct Size:"},null,null,null,"Optional"]
[null,"Sort Plate:","By Columns"]
[]
[]
[null,"Well Position","Sample Name                              "]
[null,"A1"]
[null,{"$f":"IF($C$9=\"By Rows\",\"A2\",\"B1\")","v":"B1"}]
[null,{"$f":"IF($C$9=\"By Rows\",\"A3\",\"C1\")","v":"C1"}]
[null,{"$f":"IF($C$9=\"By Rows\",\"A4\",\"D1\")","v":"D1"}]
[null,{"$f":"IF($C$9=\"By Rows\",\"A5\",\"E1\")","v":"E1"}]
[null,{"$f":"IF($C$9=\"By Rows\",\"A6\",\"F1\")","v":"F1"}]
[null,{"$f":"IF($C$9=\"By Rows\",\"A7\",\"G1\")","v":"G1"}]
[null,{"$f":"IF($C$9=\"By Rows\",\"A8\",\"H1\")","v":"H1"}]
[null,{"$f":"IF($C$9=\"By Rows\",\"A9\",\"A2\")","v":"A2"}]
[null,{"$f":"IF($C$9=\"By Rows\",\"A10\",\"B2\")","v":"B2"}]
[null,{"$f":"IF($C$9=\"By Rows\",\"A11\",\"C2\")","v":"C2"}]
[null,{"$f":"IF($C$9=\"By Rows\",\"A12\",\"D2\")","v":"D2"}]
[null,{"$f":"IF($C$9=\"By Rows\",\"B1\",\"E2\")","v":"E2"}]
[null,{"$f":"IF($C$9=\"By Rows\",\"B2\",\"F2\")","v":"F2"}]
[null,{"$f":"IF($C$9=\"By Rows\",\"B3\",\"G2\")","v":"G2"}]
[null,{"$f":"IF($C$9=\"By Rows\",\"B4\",\"H2\")","v":"H2"}]
[null,{"$f":"IF($C$9=\"By Rows\",\"B5\",\"A3\")","v":"A3"}]
[null,{"$f":"IF($C$9=\"By Rows\",\"B6\",\"B3\")","v":"B3"}]
[null,{"$f":"IF($C$9=\"By Rows\",\"B7\",\"C3\")","v":"C3"}]
[null,{"$f":"IF($C$9=\"By Rows\",\"B8\",\"D3\")","v":"D3"}]
[null,{"$f":"IF($C$9=\"By Rows\",\"B9\",\"E3\")","v":"E3"}]
[null,{"$f":"IF($C$9=\"By Rows\",\"B10\",\"F3\")","v":"F3"}]
[null,{"$f":"IF($C$9=\"By Rows\",\"B11\",\"G3\")","v":"G3"}]
[null,{"$f":"IF($C$9=\"By Rows\",\"B12\",\"H3\")","v":"H3"}]
[null,{"$f":"IF($C$9=\"By Rows\",\"C1\",\"A4\")","v":"A4"}]
[null,{"$f":"IF($C$9=\"By Rows\",\"C2\",\"B4\")","v":"B4"}]
[null,{"$f":"IF($C$9=\"By Rows\",\"C3\",\"C4\")","v":"C4"}]
[null,{"$f":"IF($C$9=\"By Rows\",\"C4\",\"D4\")","v":"D4"}]
[null,{"$f":"IF($C$9=\"By Rows\",\"C5\",\"E4\")","v":"E4"}]
[null,{"$f":"IF($C$9=\"By Rows\",\"C6\",\"F4\")","v":"F4"}]
[null,{"$f":"IF($C$9=\"By Rows\",\"C7\",\"G4\")","v":"G4"}]
[null,{"$f":"IF($C$9=\"By Rows\",\"C8\",\"H4\")","v":"H4"}]
[null,{"$f":"IF($C$9=\"By Rows\",\"C9\",\"A5\")","v":"A5"}]
[null,{"$f":"IF($C$9=\"By Rows\",\"C10\",\"B5\")","v":"B5"}]
[null,{"$f":"IF($C$9=\"By Rows\",\"C11\",\"C5\")","v":"C5"}]
[null,{"$f":"IF($C$9=\"By Rows\",\"C12\",\"D5\")","v":"D5"}]
[null,{"$f":"IF($C$9=\"By Rows\",\"D1\",\"E5\")","v":"E5"}]
[null,{"$f":"IF($C$9=\"By Rows\",\"D2\",\"F5\")","v":"F5"}]
[null,{"$f":"IF($C$9=\"By Rows\",\"D3\",\"G5\")","v":"G5"}]
[null,{"$f":"IF($C$9=\"By Rows\",\"D4\",\"H5\")","v":"H5"}]
[null,{"$f":"IF($C$9=\"By Rows\",\"D5\",\"A6\")","v":"A6"}]
[null,{"$f":"IF($C$9=\"By Rows\",\"D6\",\"B6\")","v":"B6"}]
[null,{"$f":"IF($C$9=\"By Rows\",\"D7\",\"C6\")","v":"C6"}]
[null,{"$f":"IF($C$9=\"By Rows\",\"D8\",\"D6\")","v":"D6"}]
[null,{"$f":"IF($C$9=\"By Rows\",\"D9\",\"E6\")","v":"E6"}]
[null,{"$f":"IF($C$9=\"By Rows\",\"D10\",\"F6\")","v":"F6"}]
[null,{"$f":"IF($C$9=\"By Rows\",\"D11\",\"G6\")","v":"G6"}]
[null,{"$f":"IF($C$9=\"By Rows\",\"D12\",\"H6\")","v":"H6"}]
[null,{"$f":"IF($C$9=\"By Rows\",\"E1\",\"A7\")","v":"A7"}]
[null,{"$f":"IF($C$9=\"By Rows\",\"E2\",\"B7\")","v":"B7"}]
[null,{"$f":"IF($C$9=\"By Rows\",\"E3\",\"C7\")","v":"C7"}]
[null,{"$f":"IF($C$9=\"By Rows\",\"E4\",\"D7\")","v":"D7"}]
[null,{"$f":"IF($C$9=\"By Rows\",\"E5\",\"E7\")","v":"E7"}]
[null,{"$f":"IF($C$9=\"By Rows\",\"E6\",\"F7\")","v":"F7"}]
[null,{"$f":"IF($C$9=\"By Rows\",\"E7\",\"G7\")","v":"G7"}]
[null,{"$f":"IF($C$9=\"By Rows\",\"E8\",\"H7\")","v":"H7"}]
[null,{"$f":"IF($C$9=\"By Rows\",\"E9\",\"A8\")","v":"A8"}]
[null,{"$f":"IF($C$9=\"By Rows\",\"E10\",\"B8\")","v":"B8"}]
[null,{"$f":"IF($C$9=\"By Rows\",\"E11\",\"C8\")","v":"C8"}]
[null,{"$f":"IF($C$9=\"By Rows\",\"E12\",\"D8\")","v":"D8"}]
[null,{"$f":"IF($C$9=\"By Rows\",\"F1\",\"E8\")","v":"E8"}]
[null,{"$f":"IF($C$9=\"By Rows\",\"F2\",\"F8\")","v":"F8"}]
[null,{"$f":"IF($C$9=\"By Rows\",\"F3\",\"G8\")","v":"G8"}]
[null,{"$f":"IF($C$9=\"By Rows\",\"F4\",\"H8\")","v":"H8"}]
[null,{"$f":"IF($C$9=\"By Rows\",\"F5\",\"A9\")","v":"A9"}]
[null,{"$f":"IF($C$9=\"By Rows\",\"F6\",\"B9\")","v":"B9"}]
[null,{"$f":"IF($C$9=\"By Rows\",\"F7\",\"C9\")","v":"C9"}]
[null,{"$f":"IF($C$9=\"By Rows\",\"F8\",\"D9\")","v":"D9"}]
[null,{"$f":"IF($C$9=\"By Rows\",\"F9\",\"E9\")","v":"E9"}]
[null,{"$f":"IF($C$9=\"By Rows\",\"F10\",\"F9\")","v":"F9"}]
[null,{"$f":"IF($C$9=\"By Rows\",\"F11\",\"G9\")","v":"G9"}]
[null,{"$f":"IF($C$9=\"By Rows\",\"F12\",\"H9\")","v":"H9"}]
[null,{"$f":"IF($C$9=\"By Rows\",\"G1\",\"A10\")","v":"A10"}]
[null,{"$f":"IF($C$9=\"By Rows\",\"G2\",\"B10\")","v":"B10"}]
[null,{"$f":"IF($C$9=\"By Rows\",\"G3\",\"C10\")","v":"C10"}]
[null,{"$f":"IF($C$9=\"By Rows\",\"G4\",\"D10\")","v":"D10"}]
[null,{"$f":"IF($C$9=\"By Rows\",\"G5\",\"E10\")","v":"E10"}]
[null,{"$f":"IF($C$9=\"By Rows\",\"G6\",\"F10\")","v":"F10"}]
[null,{"$f":"IF($C$9=\"By Rows\",\"G7\",\"G10\")","v":"G10"}]
[null,{"$f":"IF($C$9=\"By Rows\",\"G8\",\"H10\")","v":"H10"}]
[null,{"$f":"IF($C$9=\"By Rows\",\"G9\",\"A11\")","v":"A11"}]
[null,{"$f":"IF($C$9=\"By Rows\",\"G10\",\"B11\")","v":"B11"}]
[null,{"$f":"IF($C$9=\"By Rows\",\"G11\",\"C11\")","v":"C11"}]
[null,{"$f":"IF($C$9=\"By Rows\",\"G12\",\"D11\")","v":"D11"}]
[null,{"$f":"IF($C$9=\"By Rows\",\"H1\",\"E11\")","v":"E11"}]
[null,{"$f":"IF($C$9=\"By Rows\",\"H2\",\"F11\")","v":"F11"}]
[null,{"$f":"IF($C$9=\"By Rows\",\"H3\",\"G11\")","v":"G11"}]
[null,{"$f":"IF($C$9=\"By Rows\",\"H4\",\"H11\")","v":"H11"}]
[null,{"$f":"IF($C$9=\"By Rows\",\"H5\",\"A12\")","v":"A12"},{"$nulls":6}," "]
[null,{"$f":"IF($C$9=\"By Rows\",\"H6\",\"B12\")","v":"B12"}]
[null,{"$f":"IF($C$9=\"By Rows\",\"H7\",\"C12\")","v":"C12"}]
[null,{"$f":"IF($C$9=\"By Rows\",\"H8\",\"D12\")","v":"D12"}]
[null,{"$f":"IF($C$9=\"By Rows\",\"H9\",\"E12\")","v":"E12"}]
[null,{"$f":"IF($C$9=\"By Rows\",\"H10\",\"F12\")","v":"F12"}]
[null,{"$f":"IF($C$9=\"By Rows\",\"H11\",\"G12\")","v":"G12"}]
[null,"H12"]

{"sheet":"Plate12","index":14,"n_rows":108,"n_cols":9,"rows_kept":108,"cut":false,"hidden":false,"merged":[[4,1,4,2]]}
[]
[null,"ShortSeq Plate (formerly Express Plate)"]
[null,"Upload Form"]
[]
[null,"Plate Information"]
[null,"Plate Barcode:"]
[null,"Sample Type:",null,null,null,"Mandatory"]
[null,{"$f":"IF(C7=\"PCR Products\", \"Product Length:\", \"Construct Size:\")","v":"Construct Size:"},null,null,null,"Optional"]
[null,"Sort Plate:","By Columns"]
[]
[]
[null,"Well Position","Sample Name                              "]
[null,"A1"]
[null,{"$f":"IF($C$9=\"By Rows\",\"A2\",\"B1\")","v":"B1"}]
[null,{"$f":"IF($C$9=\"By Rows\",\"A3\",\"C1\")","v":"C1"}]
[null,{"$f":"IF($C$9=\"By Rows\",\"A4\",\"D1\")","v":"D1"}]
[null,{"$f":"IF($C$9=\"By Rows\",\"A5\",\"E1\")","v":"E1"}]
[null,{"$f":"IF($C$9=\"By Rows\",\"A6\",\"F1\")","v":"F1"}]
[null,{"$f":"IF($C$9=\"By Rows\",\"A7\",\"G1\")","v":"G1"}]
[null,{"$f":"IF($C$9=\"By Rows\",\"A8\",\"H1\")","v":"H1"}]
[null,{"$f":"IF($C$9=\"By Rows\",\"A9\",\"A2\")","v":"A2"}]
[null,{"$f":"IF($C$9=\"By Rows\",\"A10\",\"B2\")","v":"B2"}]
[null,{"$f":"IF($C$9=\"By Rows\",\"A11\",\"C2\")","v":"C2"}]
[null,{"$f":"IF($C$9=\"By Rows\",\"A12\",\"D2\")","v":"D2"}]
[null,{"$f":"IF($C$9=\"By Rows\",\"B1\",\"E2\")","v":"E2"}]
[null,{"$f":"IF($C$9=\"By Rows\",\"B2\",\"F2\")","v":"F2"}]
[null,{"$f":"IF($C$9=\"By Rows\",\"B3\",\"G2\")","v":"G2"}]
[null,{"$f":"IF($C$9=\"By Rows\",\"B4\",\"H2\")","v":"H2"}]
[null,{"$f":"IF($C$9=\"By Rows\",\"B5\",\"A3\")","v":"A3"}]
[null,{"$f":"IF($C$9=\"By Rows\",\"B6\",\"B3\")","v":"B3"}]
[null,{"$f":"IF($C$9=\"By Rows\",\"B7\",\"C3\")","v":"C3"}]
[null,{"$f":"IF($C$9=\"By Rows\",\"B8\",\"D3\")","v":"D3"}]
[null,{"$f":"IF($C$9=\"By Rows\",\"B9\",\"E3\")","v":"E3"}]
[null,{"$f":"IF($C$9=\"By Rows\",\"B10\",\"F3\")","v":"F3"}]
[null,{"$f":"IF($C$9=\"By Rows\",\"B11\",\"G3\")","v":"G3"}]
[null,{"$f":"IF($C$9=\"By Rows\",\"B12\",\"H3\")","v":"H3"}]
[null,{"$f":"IF($C$9=\"By Rows\",\"C1\",\"A4\")","v":"A4"}]
[null,{"$f":"IF($C$9=\"By Rows\",\"C2\",\"B4\")","v":"B4"}]
[null,{"$f":"IF($C$9=\"By Rows\",\"C3\",\"C4\")","v":"C4"}]
[null,{"$f":"IF($C$9=\"By Rows\",\"C4\",\"D4\")","v":"D4"}]
[null,{"$f":"IF($C$9=\"By Rows\",\"C5\",\"E4\")","v":"E4"}]
[null,{"$f":"IF($C$9=\"By Rows\",\"C6\",\"F4\")","v":"F4"}]
[null,{"$f":"IF($C$9=\"By Rows\",\"C7\",\"G4\")","v":"G4"}]
[null,{"$f":"IF($C$9=\"By Rows\",\"C8\",\"H4\")","v":"H4"}]
[null,{"$f":"IF($C$9=\"By Rows\",\"C9\",\"A5\")","v":"A5"}]
[null,{"$f":"IF($C$9=\"By Rows\",\"C10\",\"B5\")","v":"B5"}]
[null,{"$f":"IF($C$9=\"By Rows\",\"C11\",\"C5\")","v":"C5"}]
[null,{"$f":"IF($C$9=\"By Rows\",\"C12\",\"D5\")","v":"D5"}]
[null,{"$f":"IF($C$9=\"By Rows\",\"D1\",\"E5\")","v":"E5"}]
[null,{"$f":"IF($C$9=\"By Rows\",\"D2\",\"F5\")","v":"F5"}]
[null,{"$f":"IF($C$9=\"By Rows\",\"D3\",\"G5\")","v":"G5"}]
[null,{"$f":"IF($C$9=\"By Rows\",\"D4\",\"H5\")","v":"H5"}]
[null,{"$f":"IF($C$9=\"By Rows\",\"D5\",\"A6\")","v":"A6"}]
[null,{"$f":"IF($C$9=\"By Rows\",\"D6\",\"B6\")","v":"B6"}]
[null,{"$f":"IF($C$9=\"By Rows\",\"D7\",\"C6\")","v":"C6"}]
[null,{"$f":"IF($C$9=\"By Rows\",\"D8\",\"D6\")","v":"D6"}]
[null,{"$f":"IF($C$9=\"By Rows\",\"D9\",\"E6\")","v":"E6"}]
[null,{"$f":"IF($C$9=\"By Rows\",\"D10\",\"F6\")","v":"F6"}]
[null,{"$f":"IF($C$9=\"By Rows\",\"D11\",\"G6\")","v":"G6"}]
[null,{"$f":"IF($C$9=\"By Rows\",\"D12\",\"H6\")","v":"H6"}]
[null,{"$f":"IF($C$9=\"By Rows\",\"E1\",\"A7\")","v":"A7"}]
[null,{"$f":"IF($C$9=\"By Rows\",\"E2\",\"B7\")","v":"B7"}]
[null,{"$f":"IF($C$9=\"By Rows\",\"E3\",\"C7\")","v":"C7"}]
[null,{"$f":"IF($C$9=\"By Rows\",\"E4\",\"D7\")","v":"D7"}]
[null,{"$f":"IF($C$9=\"By Rows\",\"E5\",\"E7\")","v":"E7"}]
[null,{"$f":"IF($C$9=\"By Rows\",\"E6\",\"F7\")","v":"F7"}]
[null,{"$f":"IF($C$9=\"By Rows\",\"E7\",\"G7\")","v":"G7"}]
[null,{"$f":"IF($C$9=\"By Rows\",\"E8\",\"H7\")","v":"H7"}]
[null,{"$f":"IF($C$9=\"By Rows\",\"E9\",\"A8\")","v":"A8"}]
[null,{"$f":"IF($C$9=\"By Rows\",\"E10\",\"B8\")","v":"B8"}]
[null,{"$f":"IF($C$9=\"By Rows\",\"E11\",\"C8\")","v":"C8"}]
[null,{"$f":"IF($C$9=\"By Rows\",\"E12\",\"D8\")","v":"D8"}]
[null,{"$f":"IF($C$9=\"By Rows\",\"F1\",\"E8\")","v":"E8"}]
[null,{"$f":"IF($C$9=\"By Rows\",\"F2\",\"F8\")","v":"F8"}]
[null,{"$f":"IF($C$9=\"By Rows\",\"F3\",\"G8\")","v":"G8"}]
[null,{"$f":"IF($C$9=\"By Rows\",\"F4\",\"H8\")","v":"H8"}]
[null,{"$f":"IF($C$9=\"By Rows\",\"F5\",\"A9\")","v":"A9"}]
[null,{"$f":"IF($C$9=\"By Rows\",\"F6\",\"B9\")","v":"B9"}]
[null,{"$f":"IF($C$9=\"By Rows\",\"F7\",\"C9\")","v":"C9"}]
[null,{"$f":"IF($C$9=\"By Rows\",\"F8\",\"D9\")","v":"D9"}]
[null,{"$f":"IF($C$9=\"By Rows\",\"F9\",\"E9\")","v":"E9"}]
[null,{"$f":"IF($C$9=\"By Rows\",\"F10\",\"F9\")","v":"F9"}]
[null,{"$f":"IF($C$9=\"By Rows\",\"F11\",\"G9\")","v":"G9"}]
[null,{"$f":"IF($C$9=\"By Rows\",\"F12\",\"H9\")","v":"H9"}]
[null,{"$f":"IF($C$9=\"By Rows\",\"G1\",\"A10\")","v":"A10"}]
[null,{"$f":"IF($C$9=\"By Rows\",\"G2\",\"B10\")","v":"B10"}]
[null,{"$f":"IF($C$9=\"By Rows\",\"G3\",\"C10\")","v":"C10"}]
[null,{"$f":"IF($C$9=\"By Rows\",\"G4\",\"D10\")","v":"D10"}]
[null,{"$f":"IF($C$9=\"By Rows\",\"G5\",\"E10\")","v":"E10"}]
[null,{"$f":"IF($C$9=\"By Rows\",\"G6\",\"F10\")","v":"F10"}]
[null,{"$f":"IF($C$9=\"By Rows\",\"G7\",\"G10\")","v":"G10"}]
[null,{"$f":"IF($C$9=\"By Rows\",\"G8\",\"H10\")","v":"H10"}]
[null,{"$f":"IF($C$9=\"By Rows\",\"G9\",\"A11\")","v":"A11"}]
[null,{"$f":"IF($C$9=\"By Rows\",\"G10\",\"B11\")","v":"B11"}]
[null,{"$f":"IF($C$9=\"By Rows\",\"G11\",\"C11\")","v":"C11"}]
[null,{"$f":"IF($C$9=\"By Rows\",\"G12\",\"D11\")","v":"D11"}]
[null,{"$f":"IF($C$9=\"By Rows\",\"H1\",\"E11\")","v":"E11"}]
[null,{"$f":"IF($C$9=\"By Rows\",\"H2\",\"F11\")","v":"F11"}]
[null,{"$f":"IF($C$9=\"By Rows\",\"H3\",\"G11\")","v":"G11"}]
[null,{"$f":"IF($C$9=\"By Rows\",\"H4\",\"H11\")","v":"H11"}]
[null,{"$f":"IF($C$9=\"By Rows\",\"H5\",\"A12\")","v":"A12"},{"$nulls":6}," "]
[null,{"$f":"IF($C$9=\"By Rows\",\"H6\",\"B12\")","v":"B12"}]
[null,{"$f":"IF($C$9=\"By Rows\",\"H7\",\"C12\")","v":"C12"}]
[null,{"$f":"IF($C$9=\"By Rows\",\"H8\",\"D12\")","v":"D12"}]
[null,{"$f":"IF($C$9=\"By Rows\",\"H9\",\"E12\")","v":"E12"}]
[null,{"$f":"IF($C$9=\"By Rows\",\"H10\",\"F12\")","v":"F12"}]
[null,{"$f":"IF($C$9=\"By Rows\",\"H11\",\"G12\")","v":"G12"}]
[null,"H12"]

{"sheet":"Plate13","index":15,"n_rows":108,"n_cols":9,"rows_kept":108,"cut":false,"hidden":false,"merged":[[4,1,4,2]]}
[]
[null,"ShortSeq Plate (formerly Express Plate)"]
[null,"Upload Form"]
[]
[null,"Plate Information"]
[null,"Plate Barcode:"]
[null,"Sample Type:",null,null,null,"Mandatory"]
[null,{"$f":"IF(C7=\"PCR Products\", \"Product Length:\", \"Construct Size:\")","v":"Construct Size:"},null,null,null,"Optional"]
[null,"Sort Plate:","By Columns"]
[]
[]
[null,"Well Position","Sample Name                              "]
[null,"A1"]
[null,{"$f":"IF($C$9=\"By Rows\",\"A2\",\"B1\")","v":"B1"}]
[null,{"$f":"IF($C$9=\"By Rows\",\"A3\",\"C1\")","v":"C1"}]
[null,{"$f":"IF($C$9=\"By Rows\",\"A4\",\"D1\")","v":"D1"}]
[null,{"$f":"IF($C$9=\"By Rows\",\"A5\",\"E1\")","v":"E1"}]
[null,{"$f":"IF($C$9=\"By Rows\",\"A6\",\"F1\")","v":"F1"}]
[null,{"$f":"IF($C$9=\"By Rows\",\"A7\",\"G1\")","v":"G1"}]
[null,{"$f":"IF($C$9=\"By Rows\",\"A8\",\"H1\")","v":"H1"}]
[null,{"$f":"IF($C$9=\"By Rows\",\"A9\",\"A2\")","v":"A2"}]
[null,{"$f":"IF($C$9=\"By Rows\",\"A10\",\"B2\")","v":"B2"}]
[null,{"$f":"IF($C$9=\"By Rows\",\"A11\",\"C2\")","v":"C2"}]
[null,{"$f":"IF($C$9=\"By Rows\",\"A12\",\"D2\")","v":"D2"}]
[null,{"$f":"IF($C$9=\"By Rows\",\"B1\",\"E2\")","v":"E2"}]
[null,{"$f":"IF($C$9=\"By Rows\",\"B2\",\"F2\")","v":"F2"}]
[null,{"$f":"IF($C$9=\"By Rows\",\"B3\",\"G2\")","v":"G2"}]
[null,{"$f":"IF($C$9=\"By Rows\",\"B4\",\"H2\")","v":"H2"}]
[null,{"$f":"IF($C$9=\"By Rows\",\"B5\",\"A3\")","v":"A3"}]
[null,{"$f":"IF($C$9=\"By Rows\",\"B6\",\"B3\")","v":"B3"}]
[null,{"$f":"IF($C$9=\"By Rows\",\"B7\",\"C3\")","v":"C3"}]
[null,{"$f":"IF($C$9=\"By Rows\",\"B8\",\"D3\")","v":"D3"}]
[null,{"$f":"IF($C$9=\"By Rows\",\"B9\",\"E3\")","v":"E3"}]
[null,{"$f":"IF($C$9=\"By Rows\",\"B10\",\"F3\")","v":"F3"}]
[null,{"$f":"IF($C$9=\"By Rows\",\"B11\",\"G3\")","v":"G3"}]
[null,{"$f":"IF($C$9=\"By Rows\",\"B12\",\"H3\")","v":"H3"}]
[null,{"$f":"IF($C$9=\"By Rows\",\"C1\",\"A4\")","v":"A4"}]
[null,{"$f":"IF($C$9=\"By Rows\",\"C2\",\"B4\")","v":"B4"}]
[null,{"$f":"IF($C$9=\"By Rows\",\"C3\",\"C4\")","v":"C4"}]
[null,{"$f":"IF($C$9=\"By Rows\",\"C4\",\"D4\")","v":"D4"}]
[null,{"$f":"IF($C$9=\"By Rows\",\"C5\",\"E4\")","v":"E4"}]
[null,{"$f":"IF($C$9=\"By Rows\",\"C6\",\"F4\")","v":"F4"}]
[null,{"$f":"IF($C$9=\"By Rows\",\"C7\",\"G4\")","v":"G4"}]
[null,{"$f":"IF($C$9=\"By Rows\",\"C8\",\"H4\")","v":"H4"}]
[null,{"$f":"IF($C$9=\"By Rows\",\"C9\",\"A5\")","v":"A5"}]
[null,{"$f":"IF($C$9=\"By Rows\",\"C10\",\"B5\")","v":"B5"}]
[null,{"$f":"IF($C$9=\"By Rows\",\"C11\",\"C5\")","v":"C5"}]
[null,{"$f":"IF($C$9=\"By Rows\",\"C12\",\"D5\")","v":"D5"}]
[null,{"$f":"IF($C$9=\"By Rows\",\"D1\",\"E5\")","v":"E5"}]
[null,{"$f":"IF($C$9=\"By Rows\",\"D2\",\"F5\")","v":"F5"}]
[null,{"$f":"IF($C$9=\"By Rows\",\"D3\",\"G5\")","v":"G5"}]
[null,{"$f":"IF($C$9=\"By Rows\",\"D4\",\"H5\")","v":"H5"}]
[null,{"$f":"IF($C$9=\"By Rows\",\"D5\",\"A6\")","v":"A6"}]
[null,{"$f":"IF($C$9=\"By Rows\",\"D6\",\"B6\")","v":"B6"}]
[null,{"$f":"IF($C$9=\"By Rows\",\"D7\",\"C6\")","v":"C6"}]
[null,{"$f":"IF($C$9=\"By Rows\",\"D8\",\"D6\")","v":"D6"}]
[null,{"$f":"IF($C$9=\"By Rows\",\"D9\",\"E6\")","v":"E6"}]
[null,{"$f":"IF($C$9=\"By Rows\",\"D10\",\"F6\")","v":"F6"}]
[null,{"$f":"IF($C$9=\"By Rows\",\"D11\",\"G6\")","v":"G6"}]
[null,{"$f":"IF($C$9=\"By Rows\",\"D12\",\"H6\")","v":"H6"}]
[null,{"$f":"IF($C$9=\"By Rows\",\"E1\",\"A7\")","v":"A7"}]
[null,{"$f":"IF($C$9=\"By Rows\",\"E2\",\"B7\")","v":"B7"}]
[null,{"$f":"IF($C$9=\"By Rows\",\"E3\",\"C7\")","v":"C7"}]
[null,{"$f":"IF($C$9=\"By Rows\",\"E4\",\"D7\")","v":"D7"}]
[null,{"$f":"IF($C$9=\"By Rows\",\"E5\",\"E7\")","v":"E7"}]
[null,{"$f":"IF($C$9=\"By Rows\",\"E6\",\"F7\")","v":"F7"}]
[null,{"$f":"IF($C$9=\"By Rows\",\"E7\",\"G7\")","v":"G7"}]
[null,{"$f":"IF($C$9=\"By Rows\",\"E8\",\"H7\")","v":"H7"}]
[null,{"$f":"IF($C$9=\"By Rows\",\"E9\",\"A8\")","v":"A8"}]
[null,{"$f":"IF($C$9=\"By Rows\",\"E10\",\"B8\")","v":"B8"}]
[null,{"$f":"IF($C$9=\"By Rows\",\"E11\",\"C8\")","v":"C8"}]
[null,{"$f":"IF($C$9=\"By Rows\",\"E12\",\"D8\")","v":"D8"}]
[null,{"$f":"IF($C$9=\"By Rows\",\"F1\",\"E8\")","v":"E8"}]
[null,{"$f":"IF($C$9=\"By Rows\",\"F2\",\"F8\")","v":"F8"}]
[null,{"$f":"IF($C$9=\"By Rows\",\"F3\",\"G8\")","v":"G8"}]
[null,{"$f":"IF($C$9=\"By Rows\",\"F4\",\"H8\")","v":"H8"}]
[null,{"$f":"IF($C$9=\"By Rows\",\"F5\",\"A9\")","v":"A9"}]
[null,{"$f":"IF($C$9=\"By Rows\",\"F6\",\"B9\")","v":"B9"}]
[null,{"$f":"IF($C$9=\"By Rows\",\"F7\",\"C9\")","v":"C9"}]
[null,{"$f":"IF($C$9=\"By Rows\",\"F8\",\"D9\")","v":"D9"}]
[null,{"$f":"IF($C$9=\"By Rows\",\"F9\",\"E9\")","v":"E9"}]
[null,{"$f":"IF($C$9=\"By Rows\",\"F10\",\"F9\")","v":"F9"}]
[null,{"$f":"IF($C$9=\"By Rows\",\"F11\",\"G9\")","v":"G9"}]
[null,{"$f":"IF($C$9=\"By Rows\",\"F12\",\"H9\")","v":"H9"}]
[null,{"$f":"IF($C$9=\"By Rows\",\"G1\",\"A10\")","v":"A10"}]
[null,{"$f":"IF($C$9=\"By Rows\",\"G2\",\"B10\")","v":"B10"}]
[null,{"$f":"IF($C$9=\"By Rows\",\"G3\",\"C10\")","v":"C10"}]
[null,{"$f":"IF($C$9=\"By Rows\",\"G4\",\"D10\")","v":"D10"}]
[null,{"$f":"IF($C$9=\"By Rows\",\"G5\",\"E10\")","v":"E10"}]
[null,{"$f":"IF($C$9=\"By Rows\",\"G6\",\"F10\")","v":"F10"}]
[null,{"$f":"IF($C$9=\"By Rows\",\"G7\",\"G10\")","v":"G10"}]
[null,{"$f":"IF($C$9=\"By Rows\",\"G8\",\"H10\")","v":"H10"}]
[null,{"$f":"IF($C$9=\"By Rows\",\"G9\",\"A11\")","v":"A11"}]
[null,{"$f":"IF($C$9=\"By Rows\",\"G10\",\"B11\")","v":"B11"}]
[null,{"$f":"IF($C$9=\"By Rows\",\"G11\",\"C11\")","v":"C11"}]
[null,{"$f":"IF($C$9=\"By Rows\",\"G12\",\"D11\")","v":"D11"}]
[null,{"$f":"IF($C$9=\"By Rows\",\"H1\",\"E11\")","v":"E11"}]
[null,{"$f":"IF($C$9=\"By Rows\",\"H2\",\"F11\")","v":"F11"}]
[null,{"$f":"IF($C$9=\"By Rows\",\"H3\",\"G11\")","v":"G11"}]
[null,{"$f":"IF($C$9=\"By Rows\",\"H4\",\"H11\")","v":"H11"}]
[null,{"$f":"IF($C$9=\"By Rows\",\"H5\",\"A12\")","v":"A12"},{"$nulls":6}," "]
[null,{"$f":"IF($C$9=\"By Rows\",\"H6\",\"B12\")","v":"B12"}]
[null,{"$f":"IF($C$9=\"By Rows\",\"H7\",\"C12\")","v":"C12"}]
[null,{"$f":"IF($C$9=\"By Rows\",\"H8\",\"D12\")","v":"D12"}]
[null,{"$f":"IF($C$9=\"By Rows\",\"H9\",\"E12\")","v":"E12"}]
[null,{"$f":"IF($C$9=\"By Rows\",\"H10\",\"F12\")","v":"F12"}]
[null,{"$f":"IF($C$9=\"By Rows\",\"H11\",\"G12\")","v":"G12"}]
[null,"H12"]

{"sheet":"Plate14","index":16,"n_rows":108,"n_cols":9,"rows_kept":108,"cut":false,"hidden":false,"merged":[[4,1,4,2]]}
[]
[null,"ShortSeq Plate (formerly Express Plate)"]
[null,"Upload Form"]
[]
[null,"Plate Information"]
[null,"Plate Barcode:"]
[null,"Sample Type:",null,null,null,"Mandatory"]
[null,{"$f":"IF(C7=\"PCR Products\", \"Product Length:\", \"Construct Size:\")","v":"Construct Size:"},null,null,null,"Optional"]
[null,"Sort Plate:","By Columns"]
[]
[]
[null,"Well Position","Sample Name                              "]
[null,"A1"]
[null,{"$f":"IF($C$9=\"By Rows\",\"A2\",\"B1\")","v":"B1"}]
[null,{"$f":"IF($C$9=\"By Rows\",\"A3\",\"C1\")","v":"C1"}]
[null,{"$f":"IF($C$9=\"By Rows\",\"A4\",\"D1\")","v":"D1"}]
[null,{"$f":"IF($C$9=\"By Rows\",\"A5\",\"E1\")","v":"E1"}]
[null,{"$f":"IF($C$9=\"By Rows\",\"A6\",\"F1\")","v":"F1"}]
[null,{"$f":"IF($C$9=\"By Rows\",\"A7\",\"G1\")","v":"G1"}]
[null,{"$f":"IF($C$9=\"By Rows\",\"A8\",\"H1\")","v":"H1"}]
[null,{"$f":"IF($C$9=\"By Rows\",\"A9\",\"A2\")","v":"A2"}]
[null,{"$f":"IF($C$9=\"By Rows\",\"A10\",\"B2\")","v":"B2"}]
[null,{"$f":"IF($C$9=\"By Rows\",\"A11\",\"C2\")","v":"C2"}]
[null,{"$f":"IF($C$9=\"By Rows\",\"A12\",\"D2\")","v":"D2"}]
[null,{"$f":"IF($C$9=\"By Rows\",\"B1\",\"E2\")","v":"E2"}]
[null,{"$f":"IF($C$9=\"By Rows\",\"B2\",\"F2\")","v":"F2"}]
[null,{"$f":"IF($C$9=\"By Rows\",\"B3\",\"G2\")","v":"G2"}]
[null,{"$f":"IF($C$9=\"By Rows\",\"B4\",\"H2\")","v":"H2"}]
[null,{"$f":"IF($C$9=\"By Rows\",\"B5\",\"A3\")","v":"A3"}]
[null,{"$f":"IF($C$9=\"By Rows\",\"B6\",\"B3\")","v":"B3"}]
[null,{"$f":"IF($C$9=\"By Rows\",\"B7\",\"C3\")","v":"C3"}]
[null,{"$f":"IF($C$9=\"By Rows\",\"B8\",\"D3\")","v":"D3"}]
[null,{"$f":"IF($C$9=\"By Rows\",\"B9\",\"E3\")","v":"E3"}]
[null,{"$f":"IF($C$9=\"By Rows\",\"B10\",\"F3\")","v":"F3"}]
[null,{"$f":"IF($C$9=\"By Rows\",\"B11\",\"G3\")","v":"G3"}]
[null,{"$f":"IF($C$9=\"By Rows\",\"B12\",\"H3\")","v":"H3"}]
[null,{"$f":"IF($C$9=\"By Rows\",\"C1\",\"A4\")","v":"A4"}]
[null,{"$f":"IF($C$9=\"By Rows\",\"C2\",\"B4\")","v":"B4"}]
[null,{"$f":"IF($C$9=\"By Rows\",\"C3\",\"C4\")","v":"C4"}]
[null,{"$f":"IF($C$9=\"By Rows\",\"C4\",\"D4\")","v":"D4"}]
[null,{"$f":"IF($C$9=\"By Rows\",\"C5\",\"E4\")","v":"E4"}]
[null,{"$f":"IF($C$9=\"By Rows\",\"C6\",\"F4\")","v":"F4"}]
[null,{"$f":"IF($C$9=\"By Rows\",\"C7\",\"G4\")","v":"G4"}]
[null,{"$f":"IF($C$9=\"By Rows\",\"C8\",\"H4\")","v":"H4"}]
[null,{"$f":"IF($C$9=\"By Rows\",\"C9\",\"A5\")","v":"A5"}]
[null,{"$f":"IF($C$9=\"By Rows\",\"C10\",\"B5\")","v":"B5"}]
[null,{"$f":"IF($C$9=\"By Rows\",\"C11\",\"C5\")","v":"C5"}]
[null,{"$f":"IF($C$9=\"By Rows\",\"C12\",\"D5\")","v":"D5"}]
[null,{"$f":"IF($C$9=\"By Rows\",\"D1\",\"E5\")","v":"E5"}]
[null,{"$f":"IF($C$9=\"By Rows\",\"D2\",\"F5\")","v":"F5"}]
[null,{"$f":"IF($C$9=\"By Rows\",\"D3\",\"G5\")","v":"G5"}]
[null,{"$f":"IF($C$9=\"By Rows\",\"D4\",\"H5\")","v":"H5"}]
[null,{"$f":"IF($C$9=\"By Rows\",\"D5\",\"A6\")","v":"A6"}]
[null,{"$f":"IF($C$9=\"By Rows\",\"D6\",\"B6\")","v":"B6"}]
[null,{"$f":"IF($C$9=\"By Rows\",\"D7\",\"C6\")","v":"C6"}]
[null,{"$f":"IF($C$9=\"By Rows\",\"D8\",\"D6\")","v":"D6"}]
[null,{"$f":"IF($C$9=\"By Rows\",\"D9\",\"E6\")","v":"E6"}]
[null,{"$f":"IF($C$9=\"By Rows\",\"D10\",\"F6\")","v":"F6"}]
[null,{"$f":"IF($C$9=\"By Rows\",\"D11\",\"G6\")","v":"G6"}]
[null,{"$f":"IF($C$9=\"By Rows\",\"D12\",\"H6\")","v":"H6"}]
[null,{"$f":"IF($C$9=\"By Rows\",\"E1\",\"A7\")","v":"A7"}]
[null,{"$f":"IF($C$9=\"By Rows\",\"E2\",\"B7\")","v":"B7"}]
[null,{"$f":"IF($C$9=\"By Rows\",\"E3\",\"C7\")","v":"C7"}]
[null,{"$f":"IF($C$9=\"By Rows\",\"E4\",\"D7\")","v":"D7"}]
[null,{"$f":"IF($C$9=\"By Rows\",\"E5\",\"E7\")","v":"E7"}]
[null,{"$f":"IF($C$9=\"By Rows\",\"E6\",\"F7\")","v":"F7"}]
[null,{"$f":"IF($C$9=\"By Rows\",\"E7\",\"G7\")","v":"G7"}]
[null,{"$f":"IF($C$9=\"By Rows\",\"E8\",\"H7\")","v":"H7"}]
[null,{"$f":"IF($C$9=\"By Rows\",\"E9\",\"A8\")","v":"A8"}]
[null,{"$f":"IF($C$9=\"By Rows\",\"E10\",\"B8\")","v":"B8"}]
[null,{"$f":"IF($C$9=\"By Rows\",\"E11\",\"C8\")","v":"C8"}]
[null,{"$f":"IF($C$9=\"By Rows\",\"E12\",\"D8\")","v":"D8"}]
[null,{"$f":"IF($C$9=\"By Rows\",\"F1\",\"E8\")","v":"E8"}]
[null,{"$f":"IF($C$9=\"By Rows\",\"F2\",\"F8\")","v":"F8"}]
[null,{"$f":"IF($C$9=\"By Rows\",\"F3\",\"G8\")","v":"G8"}]
[null,{"$f":"IF($C$9=\"By Rows\",\"F4\",\"H8\")","v":"H8"}]
[null,{"$f":"IF($C$9=\"By Rows\",\"F5\",\"A9\")","v":"A9"}]
[null,{"$f":"IF($C$9=\"By Rows\",\"F6\",\"B9\")","v":"B9"}]
[null,{"$f":"IF($C$9=\"By Rows\",\"F7\",\"C9\")","v":"C9"}]
[null,{"$f":"IF($C$9=\"By Rows\",\"F8\",\"D9\")","v":"D9"}]
[null,{"$f":"IF($C$9=\"By Rows\",\"F9\",\"E9\")","v":"E9"}]
[null,{"$f":"IF($C$9=\"By Rows\",\"F10\",\"F9\")","v":"F9"}]
[null,{"$f":"IF($C$9=\"By Rows\",\"F11\",\"G9\")","v":"G9"}]
[null,{"$f":"IF($C$9=\"By Rows\",\"F12\",\"H9\")","v":"H9"}]
[null,{"$f":"IF($C$9=\"By Rows\",\"G1\",\"A10\")","v":"A10"}]
[null,{"$f":"IF($C$9=\"By Rows\",\"G2\",\"B10\")","v":"B10"}]
[null,{"$f":"IF($C$9=\"By Rows\",\"G3\",\"C10\")","v":"C10"}]
[null,{"$f":"IF($C$9=\"By Rows\",\"G4\",\"D10\")","v":"D10"}]
[null,{"$f":"IF($C$9=\"By Rows\",\"G5\",\"E10\")","v":"E10"}]
[null,{"$f":"IF($C$9=\"By Rows\",\"G6\",\"F10\")","v":"F10"}]
[null,{"$f":"IF($C$9=\"By Rows\",\"G7\",\"G10\")","v":"G10"}]
[null,{"$f":"IF($C$9=\"By Rows\",\"G8\",\"H10\")","v":"H10"}]
[null,{"$f":"IF($C$9=\"By Rows\",\"G9\",\"A11\")","v":"A11"}]
[null,{"$f":"IF($C$9=\"By Rows\",\"G10\",\"B11\")","v":"B11"}]
[null,{"$f":"IF($C$9=\"By Rows\",\"G11\",\"C11\")","v":"C11"}]
[null,{"$f":"IF($C$9=\"By Rows\",\"G12\",\"D11\")","v":"D11"}]
[null,{"$f":"IF($C$9=\"By Rows\",\"H1\",\"E11\")","v":"E11"}]
[null,{"$f":"IF($C$9=\"By Rows\",\"H2\",\"F11\")","v":"F11"}]
[null,{"$f":"IF($C$9=\"By Rows\",\"H3\",\"G11\")","v":"G11"}]
[null,{"$f":"IF($C$9=\"By Rows\",\"H4\",\"H11\")","v":"H11"}]
[null,{"$f":"IF($C$9=\"By Rows\",\"H5\",\"A12\")","v":"A12"},{"$nulls":6}," "]
[null,{"$f":"IF($C$9=\"By Rows\",\"H6\",\"B12\")","v":"B12"}]
[null,{"$f":"IF($C$9=\"By Rows\",\"H7\",\"C12\")","v":"C12"}]
[null,{"$f":"IF($C$9=\"By Rows\",\"H8\",\"D12\")","v":"D12"}]
[null,{"$f":"IF($C$9=\"By Rows\",\"H9\",\"E12\")","v":"E12"}]
[null,{"$f":"IF($C$9=\"By Rows\",\"H10\",\"F12\")","v":"F12"}]
[null,{"$f":"IF($C$9=\"By Rows\",\"H11\",\"G12\")","v":"G12"}]
[null,"H12"]

{"sheet":"Plate15","index":17,"n_rows":108,"n_cols":9,"rows_kept":108,"cut":false,"hidden":false,"merged":[[4,1,4,2]]}
[]
[null,"ShortSeq Plate (formerly Express Plate)"]
[null,"Upload Form"]
[]
[null,"Plate Information"]
[null,"Plate Barcode:"]
[null,"Sample Type:",null,null,null,"Mandatory"]
[null,{"$f":"IF(C7=\"PCR Products\", \"Product Length:\", \"Construct Size:\")","v":"Construct Size:"},null,null,null,"Optional"]
[null,"Sort Plate:","By Columns"]
[]
[]
[null,"Well Position","Sample Name                              "]
[null,"A1"]
[null,{"$f":"IF($C$9=\"By Rows\",\"A2\",\"B1\")","v":"B1"}]
[null,{"$f":"IF($C$9=\"By Rows\",\"A3\",\"C1\")","v":"C1"}]
[null,{"$f":"IF($C$9=\"By Rows\",\"A4\",\"D1\")","v":"D1"}]
[null,{"$f":"IF($C$9=\"By Rows\",\"A5\",\"E1\")","v":"E1"}]
[null,{"$f":"IF($C$9=\"By Rows\",\"A6\",\"F1\")","v":"F1"}]
[null,{"$f":"IF($C$9=\"By Rows\",\"A7\",\"G1\")","v":"G1"}]
[null,{"$f":"IF($C$9=\"By Rows\",\"A8\",\"H1\")","v":"H1"}]
[null,{"$f":"IF($C$9=\"By Rows\",\"A9\",\"A2\")","v":"A2"}]
[null,{"$f":"IF($C$9=\"By Rows\",\"A10\",\"B2\")","v":"B2"}]
[null,{"$f":"IF($C$9=\"By Rows\",\"A11\",\"C2\")","v":"C2"}]
[null,{"$f":"IF($C$9=\"By Rows\",\"A12\",\"D2\")","v":"D2"}]
[null,{"$f":"IF($C$9=\"By Rows\",\"B1\",\"E2\")","v":"E2"}]
[null,{"$f":"IF($C$9=\"By Rows\",\"B2\",\"F2\")","v":"F2"}]
[null,{"$f":"IF($C$9=\"By Rows\",\"B3\",\"G2\")","v":"G2"}]
[null,{"$f":"IF($C$9=\"By Rows\",\"B4\",\"H2\")","v":"H2"}]
[null,{"$f":"IF($C$9=\"By Rows\",\"B5\",\"A3\")","v":"A3"}]
[null,{"$f":"IF($C$9=\"By Rows\",\"B6\",\"B3\")","v":"B3"}]
[null,{"$f":"IF($C$9=\"By Rows\",\"B7\",\"C3\")","v":"C3"}]
[null,{"$f":"IF($C$9=\"By Rows\",\"B8\",\"D3\")","v":"D3"}]
[null,{"$f":"IF($C$9=\"By Rows\",\"B9\",\"E3\")","v":"E3"}]
[null,{"$f":"IF($C$9=\"By Rows\",\"B10\",\"F3\")","v":"F3"}]
[null,{"$f":"IF($C$9=\"By Rows\",\"B11\",\"G3\")","v":"G3"}]
[null,{"$f":"IF($C$9=\"By Rows\",\"B12\",\"H3\")","v":"H3"}]
[null,{"$f":"IF($C$9=\"By Rows\",\"C1\",\"A4\")","v":"A4"}]
[null,{"$f":"IF($C$9=\"By Rows\",\"C2\",\"B4\")","v":"B4"}]
[null,{"$f":"IF($C$9=\"By Rows\",\"C3\",\"C4\")","v":"C4"}]
[null,{"$f":"IF($C$9=\"By Rows\",\"C4\",\"D4\")","v":"D4"}]
[null,{"$f":"IF($C$9=\"By Rows\",\"C5\",\"E4\")","v":"E4"}]
[null,{"$f":"IF($C$9=\"By Rows\",\"C6\",\"F4\")","v":"F4"}]
[null,{"$f":"IF($C$9=\"By Rows\",\"C7\",\"G4\")","v":"G4"}]
[null,{"$f":"IF($C$9=\"By Rows\",\"C8\",\"H4\")","v":"H4"}]
[null,{"$f":"IF($C$9=\"By Rows\",\"C9\",\"A5\")","v":"A5"}]
[null,{"$f":"IF($C$9=\"By Rows\",\"C10\",\"B5\")","v":"B5"}]
[null,{"$f":"IF($C$9=\"By Rows\",\"C11\",\"C5\")","v":"C5"}]
[null,{"$f":"IF($C$9=\"By Rows\",\"C12\",\"D5\")","v":"D5"}]
[null,{"$f":"IF($C$9=\"By Rows\",\"D1\",\"E5\")","v":"E5"}]
[null,{"$f":"IF($C$9=\"By Rows\",\"D2\",\"F5\")","v":"F5"}]
[null,{"$f":"IF($C$9=\"By Rows\",\"D3\",\"G5\")","v":"G5"}]
[null,{"$f":"IF($C$9=\"By Rows\",\"D4\",\"H5\")","v":"H5"}]
[null,{"$f":"IF($C$9=\"By Rows\",\"D5\",\"A6\")","v":"A6"}]
[null,{"$f":"IF($C$9=\"By Rows\",\"D6\",\"B6\")","v":"B6"}]
[null,{"$f":"IF($C$9=\"By Rows\",\"D7\",\"C6\")","v":"C6"}]
[null,{"$f":"IF($C$9=\"By Rows\",\"D8\",\"D6\")","v":"D6"}]
[null,{"$f":"IF($C$9=\"By Rows\",\"D9\",\"E6\")","v":"E6"}]
[null,{"$f":"IF($C$9=\"By Rows\",\"D10\",\"F6\")","v":"F6"}]
[null,{"$f":"IF($C$9=\"By Rows\",\"D11\",\"G6\")","v":"G6"}]
[null,{"$f":"IF($C$9=\"By Rows\",\"D12\",\"H6\")","v":"H6"}]
[null,{"$f":"IF($C$9=\"By Rows\",\"E1\",\"A7\")","v":"A7"}]
[null,{"$f":"IF($C$9=\"By Rows\",\"E2\",\"B7\")","v":"B7"}]
[null,{"$f":"IF($C$9=\"By Rows\",\"E3\",\"C7\")","v":"C7"}]
[null,{"$f":"IF($C$9=\"By Rows\",\"E4\",\"D7\")","v":"D7"}]
[null,{"$f":"IF($C$9=\"By Rows\",\"E5\",\"E7\")","v":"E7"}]
[null,{"$f":"IF($C$9=\"By Rows\",\"E6\",\"F7\")","v":"F7"}]
[null,{"$f":"IF($C$9=\"By Rows\",\"E7\",\"G7\")","v":"G7"}]
[null,{"$f":"IF($C$9=\"By Rows\",\"E8\",\"H7\")","v":"H7"}]
[null,{"$f":"IF($C$9=\"By Rows\",\"E9\",\"A8\")","v":"A8"}]
[null,{"$f":"IF($C$9=\"By Rows\",\"E10\",\"B8\")","v":"B8"}]
[null,{"$f":"IF($C$9=\"By Rows\",\"E11\",\"C8\")","v":"C8"}]
[null,{"$f":"IF($C$9=\"By Rows\",\"E12\",\"D8\")","v":"D8"}]
[null,{"$f":"IF($C$9=\"By Rows\",\"F1\",\"E8\")","v":"E8"}]
[null,{"$f":"IF($C$9=\"By Rows\",\"F2\",\"F8\")","v":"F8"}]
[null,{"$f":"IF($C$9=\"By Rows\",\"F3\",\"G8\")","v":"G8"}]
[null,{"$f":"IF($C$9=\"By Rows\",\"F4\",\"H8\")","v":"H8"}]
[null,{"$f":"IF($C$9=\"By Rows\",\"F5\",\"A9\")","v":"A9"}]
[null,{"$f":"IF($C$9=\"By Rows\",\"F6\",\"B9\")","v":"B9"}]
[null,{"$f":"IF($C$9=\"By Rows\",\"F7\",\"C9\")","v":"C9"}]
[null,{"$f":"IF($C$9=\"By Rows\",\"F8\",\"D9\")","v":"D9"}]
[null,{"$f":"IF($C$9=\"By Rows\",\"F9\",\"E9\")","v":"E9"}]
[null,{"$f":"IF($C$9=\"By Rows\",\"F10\",\"F9\")","v":"F9"}]
[null,{"$f":"IF($C$9=\"By Rows\",\"F11\",\"G9\")","v":"G9"}]
[null,{"$f":"IF($C$9=\"By Rows\",\"F12\",\"H9\")","v":"H9"}]
[null,{"$f":"IF($C$9=\"By Rows\",\"G1\",\"A10\")","v":"A10"}]
[null,{"$f":"IF($C$9=\"By Rows\",\"G2\",\"B10\")","v":"B10"}]
[null,{"$f":"IF($C$9=\"By Rows\",\"G3\",\"C10\")","v":"C10"}]
[null,{"$f":"IF($C$9=\"By Rows\",\"G4\",\"D10\")","v":"D10"}]
[null,{"$f":"IF($C$9=\"By Rows\",\"G5\",\"E10\")","v":"E10"}]
[null,{"$f":"IF($C$9=\"By Rows\",\"G6\",\"F10\")","v":"F10"}]
[null,{"$f":"IF($C$9=\"By Rows\",\"G7\",\"G10\")","v":"G10"}]
[null,{"$f":"IF($C$9=\"By Rows\",\"G8\",\"H10\")","v":"H10"}]
[null,{"$f":"IF($C$9=\"By Rows\",\"G9\",\"A11\")","v":"A11"}]
[null,{"$f":"IF($C$9=\"By Rows\",\"G10\",\"B11\")","v":"B11"}]
[null,{"$f":"IF($C$9=\"By Rows\",\"G11\",\"C11\")","v":"C11"}]
[null,{"$f":"IF($C$9=\"By Rows\",\"G12\",\"D11\")","v":"D11"}]
[null,{"$f":"IF($C$9=\"By Rows\",\"H1\",\"E11\")","v":"E11"}]
[null,{"$f":"IF($C$9=\"By Rows\",\"H2\",\"F11\")","v":"F11"}]
[null,{"$f":"IF($C$9=\"By Rows\",\"H3\",\"G11\")","v":"G11"}]
[null,{"$f":"IF($C$9=\"By Rows\",\"H4\",\"H11\")","v":"H11"}]
[null,{"$f":"IF($C$9=\"By Rows\",\"H5\",\"A12\")","v":"A12"},{"$nulls":6}," "]
[null,{"$f":"IF($C$9=\"By Rows\",\"H6\",\"B12\")","v":"B12"}]
[null,{"$f":"IF($C$9=\"By Rows\",\"H7\",\"C12\")","v":"C12"}]
[null,{"$f":"IF($C$9=\"By Rows\",\"H8\",\"D12\")","v":"D12"}]
[null,{"$f":"IF($C$9=\"By Rows\",\"H9\",\"E12\")","v":"E12"}]
[null,{"$f":"IF($C$9=\"By Rows\",\"H10\",\"F12\")","v":"F12"}]
[null,{"$f":"IF($C$9=\"By Rows\",\"H11\",\"G12\")","v":"G12"}]
[null,"H12"]